Raspbian Package Auto-Building

Buildd status for libnunc-stans (buster-staging)

Debian PTSTrackerChangelogBugspackages.d.obuildd.d.o

Package(s): Suite:
Compact mode Co-maintainers

ArchitectureVersionStatusForBuilddStateMiscLogs
Buildd exposure stats armhf  0.1.8-1Build-Attempted164d 5h 45mmb-lxc-01uncompiledmisc:sourceold | all (30)

Tail of log for libnunc-stans on armhf:

mkdir -p bin
mkdir -p obj
gcc -MM -std=c99 -I"src" -I"inc" src/abstraction/abstraction_dcas.c >obj/abstraction_dcas.d
gcc -g -O2 -fdebug-prefix-map=/<<PKGBUILDDIR>>=. -fstack-protector-strong -Wformat -Werror=format-security  -c -fpic -Wno-unknown-pragmas -std=c99 -I"src" -I"inc"  -o obj/abstraction_dcas.o src/abstraction/abstraction_dcas.c
/tmp/ccGpCjrq.s: Assembler messages:
/tmp/ccGpCjrq.s:61: Error: selected processor does not support `ldrexd r6,r7,[lr]' in ARM mode
/tmp/ccGpCjrq.s:61: Error: selected processor does not support `strexd r0,r2,r3,[lr]' in ARM mode
make[3]: *** [makefile.linux:79: obj/abstraction_dcas.o] Error 1
make[3]: Leaving directory '/<<PKGBUILDDIR>>/liblfds'
make[2]: *** [Makefile:921: all-recursive] Error 1
make[2]: Leaving directory '/<<PKGBUILDDIR>>'
make[1]: *** [Makefile:646: all] Error 2
make[1]: Leaving directory '/<<PKGBUILDDIR>>'
dh_auto_build: make -j1 returned exit code 2
make: *** [debian/rules:21: build-arch] Error 2