Raspbian Package Auto-Building

Buildd status for libmaus2 (bullseye-staging)

Debian PTSTrackerChangelogBugspackages.d.obuildd.d.o

Package(s): Suite:
Compact mode Co-maintainers

ArchitectureVersionStatusForBuilddStateMiscLogs
Buildd exposure stats armhf  2.0.722+dfsg-1Build-Attempted72d 18h 50mmb-lxc-01uncompiledmisc:sourceold | all (2)

Tail of log for libmaus2 on armhf:

                 from test/testsamrecoding.cpp:19:
/usr/include/c++/10/bits/vector.tcc: In function ‘int main(int, char**)’:
/usr/include/c++/10/bits/vector.tcc:121:21: note: parameter passing for argument of type ‘__gnu_cxx::__normal_iterator<libmaus2::bambam::BamAlignmentDecoderInfo*, std::vector<libmaus2::bambam::BamAlignmentDecoderInfo> >’ changed in GCC 7.1
  121 |    _M_realloc_insert(end(), std::forward<_Args>(__args)...);
      |    ~~~~~~~~~~~~~~~~~^~~~~~~~~~~~~~~~~~~~~~~~~~~~~~~~~~~~~~~
/usr/include/c++/10/bits/vector.tcc:121:21: note: parameter passing for argument of type ‘__gnu_cxx::__normal_iterator<libmaus2::bambam::BamAlignmentDecoderInfo*, std::vector<libmaus2::bambam::BamAlignmentDecoderInfo> >’ changed in GCC 7.1
  121 |    _M_realloc_insert(end(), std::forward<_Args>(__args)...);
      |    ~~~~~~~~~~~~~~~~~^~~~~~~~~~~~~~~~~~~~~~~~~~~~~~~~~~~~~~~
make[3]: Leaving directory '/<<BUILDDIR>>/libmaus2-2.0.722+dfsg/src'
make[2]: *** [Makefile:692: all-recursive] Error 1
make[2]: Leaving directory '/<<BUILDDIR>>/libmaus2-2.0.722+dfsg'
make[1]: *** [Makefile:574: all] Error 2
make[1]: Leaving directory '/<<BUILDDIR>>/libmaus2-2.0.722+dfsg'
dh_auto_build: error: make -j4 returned exit code 2
make: *** [debian/rules:12: binary-arch] Error 25