Raspbian Package Auto-Building

Buildd status for libmateweather (jessie-staging)

Debian PTSTrackerChangelogBugspackages.d.obuildd.d.o

Package(s): Suite:
Compact mode Co-maintainers

ArchitectureVersionStatusForBuilddStateMiscLogs
Buildd exposure stats armhf  1.8.0-2+deb8u2Build-Attempted183d 14h 17mtestwandboardout-of-datemisc:sourceold | all (2)

Tail of log for libmateweather on armhf:

make[2]: Leaving directory '/<<PKGBUILDDIR>>/doc'
Making check in data
make[2]: Entering directory '/<<PKGBUILDDIR>>/data'
xmllint --valid --noout ../data/Locations.xml.in
./check-timezones.sh ./Locations.xml.in
Invalid timezones in ./Locations.xml.in: Asia/Yangon
Makefile:638: recipe for target 'check' failed
make[2]: *** [check] Error 1
make[2]: Leaving directory '/<<PKGBUILDDIR>>/data'
Makefile:488: recipe for target 'check-recursive' failed
make[1]: *** [check-recursive] Error 1
make[1]: Leaving directory '/<<PKGBUILDDIR>>'
dh_auto_test: make -j4 check returned exit code 2
debian/rules:6: recipe for target 'build-arch' failed
make: *** [build-arch] Error 2