Raspbian Package Auto-Building

Buildd status for libgit2 (stretch-staging)

Debian PTSTrackerChangelogBugspackages.d.obuildd.d.o

Package(s): Suite:
Compact mode Co-maintainers

ArchitectureVersionStatusForBuilddStateMiscLogs
Buildd exposure stats armhf  0.25.1+really0.24.6-1Build-Attempted903d 2h 21mbm-wb-04out-of-datelibs:sourceold | all (2)

Tail of log for libgit2 on armhf:

Total Test time (real) = 244.37 sec

The following tests FAILED:
	  1 - libgit2_clar (Failed)
Errors while running CTest
Makefile:108: recipe for target 'test' failed
make[2]: *** [test] Error 8
make[2]: Leaving directory '/<<BUILDDIR>>/libgit2-0.25.1+really0.24.6/build-debian-release'
dh_auto_test: make -j4 test ARGS+=-j4 returned exit code 2
debian/rules:46: recipe for target 'override_dh_auto_test' failed
make[1]: *** [override_dh_auto_test] Error 2
make[1]: Leaving directory '/<<BUILDDIR>>/libgit2-0.25.1+really0.24.6'
debian/rules:58: recipe for target 'build-arch' failed
make: *** [build-arch] Error 2