Raspbian Package Auto-Building

Buildd status for libgcrypt20 (jessie-staging)

Debian PTSTrackerChangelogBugspackages.d.obuildd.d.o

Package(s): Suite:
Compact mode Co-maintainers

ArchitectureVersionStatusForBuilddStateMiscLogs
Buildd exposure stats armhf  1.6.3-2+deb8u8Build-Attempted16d 8h 47mmb-lxc-02out-of-datemisc:sourceold | all (1)

Tail of log for libgcrypt20 on armhf:

(1 test was not run)
Please report to http://bugs.gnupg.org
======================================
Makefile:817: recipe for target 'check-TESTS' failed
make[3]: *** [check-TESTS] Error 1
make[3]: Leaving directory '/<<PKGBUILDDIR>>/tests'
Makefile:940: recipe for target 'check-am' failed
make[2]: *** [check-am] Error 2
make[2]: Leaving directory '/<<PKGBUILDDIR>>/tests'
Makefile:477: recipe for target 'check-recursive' failed
make[1]: *** [check-recursive] Error 1
make[1]: Leaving directory '/<<PKGBUILDDIR>>'
dh_auto_test: make -j4 check returned exit code 2
debian/rules:49: recipe for target 'build-arch' failed
make: *** [build-arch] Error 2