Raspbian Package Auto-Building

Buildd status for selected packages (jessie-staging)

Bugs

Package(s): Suite:
Compact mode Co-maintainers

Package armhf
Buildd exposure stats
✔ libdvdnavInstalled
✔ libterralibInstalled
✔ xfce4-weather-pluginInstalled
✔ catdocInstalled
✔ cvsInstalled
✔ augeasInstalled
✔ libidn2-0Installed
✔ konversationInstalled
✔ procmailInstalled
✔ torInstalled
✔ libxvmcInstalled
✔ libwpdInstalled
✔ elogInstalled
✔ hexchatInstalled
✔ weechatInstalled
✔ pdns-recursorInstalled
✔ libwnckmmInstalled
✔ dbInstalled
✔ sdl-image1.2Installed
Package armhf
Buildd exposure stats
✔ libsigrokInstalled
✔ libsigrokdecodeInstalled
✔ prosodyInstalled
✔ gnupg2Installed
✔ psensorInstalled
✘ openldap  Build-Attempted
✔ confuseInstalled
✔ git-annexInstalled
✔ lcms2Installed
✔ mgettyInstalled
✔ dnsmasqInstalled
✔ gnulibInstalled
✔ nginxInstalled
✔ squid3Installed
✔ xml-security-cInstalled
✔ gcc-4.9Installed
✔ postgisInstalled
✔ mariadb-10.0Installed
✔ rsshInstalled
✔ elfutilsInstalled
Package armhf
Buildd exposure stats
✔ xmltoolingInstalled
✔ libsdl2Installed
✔ libjpeg-turboInstalled
✔ ntfs-3gInstalled
✔ librawInstalled
✔ ruby2.1Installed
✔ libssh2Installed
✔ clamavInstalled
✔ systemdInstalled
✔ librecadInstalled
✔ 389-ds-baseInstalled
✔ imagemagickInstalled
✔ dhcpcd5Installed
✔ soxInstalled
✔ libgd2Installed
✔ dbusInstalled

BinNMU changelog for libsigrok on armhf:

rebuild for python 3.4

BinNMU changelog for libsigrokdecode on armhf:

rebuild for python 3.4

Tail of log for openldap on armhf:

Comparison failed
>>>>> test046-dds failed for mdb
(exit 1)
Makefile:312: recipe for target 'mdb-mod' failed
make[3]: *** [mdb-mod] Error 1
make[3]: Leaving directory '/<<BUILDDIR>>/openldap-2.4.40+dfsg/debian/build/tests'
Makefile:282: recipe for target 'test' failed
make[2]: *** [test] Error 2
make[2]: Leaving directory '/<<BUILDDIR>>/openldap-2.4.40+dfsg/debian/build/tests'
Makefile:294: recipe for target 'test' failed
make[1]: *** [test] Error 2
make[1]: Leaving directory '/<<BUILDDIR>>/openldap-2.4.40+dfsg/debian/build'
dh_auto_test: make -j4 test returned exit code 2
debian/rules:54: recipe for target 'build-arch' failed
make: *** [build-arch] Error 2