Raspbian Package Auto-Building

Buildd status for libcereal (bullseye-staging)

Debian PTSTrackerChangelogBugspackages.d.obuildd.d.o

Package(s): Suite:
Compact mode Co-maintainers

ArchitectureVersionStatusForBuilddStateMiscLogs
Buildd exposure stats armhf  1.3.0-2Build-Attempted14d 10h 23mtestbuilddout-of-datemisc:optionalold | all (3)

Tail of log for libcereal on armhf:

/usr/bin/c++  -Werror -Wall -g -Wextra -Wshadow -pedantic -Wold-style-cast -g -O2 -fdebug-prefix-map=/<<PKGBUILDDIR>>=. -fstack-protector-strong -Wformat -Werror=format-security -Wdate-time -D_FORTIFY_SOURCE=2  -Wl,-z,relro CMakeFiles/test_unordered_set.dir/unordered_set.cpp.o  -o test_unordered_set 
make[4]: Leaving directory '/<<PKGBUILDDIR>>/obj-arm-linux-gnueabihf'
[ 52%] Built target test_unordered_set
[ 54%] Linking CXX executable test_load_construct
cd /<<PKGBUILDDIR>>/obj-arm-linux-gnueabihf/unittests && /usr/bin/cmake -E cmake_link_script CMakeFiles/test_load_construct.dir/link.txt --verbose=1
/usr/bin/c++  -Werror -Wall -g -Wextra -Wshadow -pedantic -Wold-style-cast -g -O2 -fdebug-prefix-map=/<<PKGBUILDDIR>>=. -fstack-protector-strong -Wformat -Werror=format-security -Wdate-time -D_FORTIFY_SOURCE=2  -Wl,-z,relro CMakeFiles/test_load_construct.dir/load_construct.cpp.o  -o test_load_construct 
make[4]: Leaving directory '/<<PKGBUILDDIR>>/obj-arm-linux-gnueabihf'
[ 54%] Built target test_load_construct
make[3]: Leaving directory '/<<PKGBUILDDIR>>/obj-arm-linux-gnueabihf'
make[2]: *** [Makefile:144: all] Error 2
make[2]: Leaving directory '/<<PKGBUILDDIR>>/obj-arm-linux-gnueabihf'
dh_auto_build: cd obj-arm-linux-gnueabihf && make -j4 "INSTALL=install --strip-program=true" all doc returned exit code 2
make[1]: *** [debian/rules:14: override_dh_auto_build] Error 255
make[1]: Leaving directory '/<<PKGBUILDDIR>>'
make: *** [debian/rules:8: build-arch] Error 2