Raspbian Package Auto-Building

Buildd status for selected packages (buster-staging)

Bugs

Package(s): Suite:
Compact mode Co-maintainers

Package armhf
Buildd exposure stats
✘ kubrick  Build-Attempted
✔ poclBuild-Attempted
✔ dxvkBuild-Attempted
✔ haskell-type-levelBuild-Attempted
✔ leela-zeroBuild-Attempted
✔ neuronBuild-Attempted
✔ qtjsbackend-opensource-srcBuild-Attempted
✔ tendermintBuild-Attempted
✔ wesnoth-1.8Build-Attempted
✔ gatb-coreBuild-Attempted
✔ thunderbirdInstalled

Tail of log for kubrick on armhf:

/<<PKGBUILDDIR>>/src/kbkglobal.h:23:27: warning: unnecessary parentheses in declaration of 'm' [-Wparentheses]
 #define LOOP(i,n) for(int ((i))=0; ((i))<((n)); ((i))++)
                           ^
/<<PKGBUILDDIR>>/src/movetracker.cpp:654:2: note: in expansion of macro 'LOOP'
  LOOP (m, nAxes) {
  ^~~~
make[4]: Leaving directory '/<<PKGBUILDDIR>>/obj-arm-linux-gnueabihf'
make[3]: *** [CMakeFiles/Makefile2:1147: src/CMakeFiles/kubrick.dir/all] Error 2
make[3]: Leaving directory '/<<PKGBUILDDIR>>/obj-arm-linux-gnueabihf'
make[2]: *** [Makefile:144: all] Error 2
make[2]: Leaving directory '/<<PKGBUILDDIR>>/obj-arm-linux-gnueabihf'
dh_auto_build: cd obj-arm-linux-gnueabihf && make -j4 "INSTALL=install --strip-program=true" returned exit code 2
make[1]: *** [/usr/share/pkg-kde-tools/qt-kde-team/3/dhmk.mk:97: pre_build-arch_dh_auto_build] Error 2
make[1]: Leaving directory '/<<PKGBUILDDIR>>'
make: *** [/usr/share/pkg-kde-tools/qt-kde-team/3/dhmk.mk:112: debian/dhmk_build-arch] Error 2

Tail of log for pocl on armhf:

- (arch=armel)_ZTVSt23_Sp_counted_ptr_inplaceIN5clang22PCHContainerOperationsESaIS1_ELN9__gnu_cxx12_Lock_policyE1EE@Base 0.12-5~llvm3.7
- (arch=!armel)_ZTVSt23_Sp_counted_ptr_inplaceIN5clang22PCHContainerOperationsESaIS1_ELN9__gnu_cxx12_Lock_policyE2EE@Base 0.12-5~llvm3.7
+ _ZTVSt23_Sp_counted_ptr_inplaceIN4llvm3sys2fs6detail12DirIterStateESaIS4_ELN9__gnu_cxx12_Lock_policyE1EE@Base 0.14-7~llvm4.0
+#MISSING: 1.2-5# (arch=!armel)_ZTVSt23_Sp_counted_ptr_inplaceIN4llvm3sys2fs6detail12DirIterStateESaIS4_ELN9__gnu_cxx12_Lock_policyE2EE@Base 0.14-7~llvm4.0
+ _ZTVSt23_Sp_counted_ptr_inplaceIN4llvm3sys2fs6detail15RecDirIterStateESaIS4_ELN9__gnu_cxx12_Lock_policyE1EE@Base 0.14-7~llvm4.0
+#MISSING: 1.2-5# (arch=!armel)_ZTVSt23_Sp_counted_ptr_inplaceIN4llvm3sys2fs6detail15RecDirIterStateESaIS4_ELN9__gnu_cxx12_Lock_policyE2EE@Base 0.14-7~llvm4.0
+ _ZTVSt23_Sp_counted_ptr_inplaceIN5clang22PCHContainerOperationsESaIS1_ELN9__gnu_cxx12_Lock_policyE1EE@Base 0.12-5~llvm3.7
+#MISSING: 1.2-5# (arch=!armel)_ZTVSt23_Sp_counted_ptr_inplaceIN5clang22PCHContainerOperationsESaIS1_ELN9__gnu_cxx12_Lock_policyE2EE@Base 0.12-5~llvm3.7
  (arch=!powerpcspe)_ZZNSt19_Sp_make_shared_tag5_S_tiEvE5__tag@Base 1.1-8~llvm6.0+gcc8.2
 #MISSING: 0.14# check_compiler_cache@Base 0.10
  clGetExtensionFunctionAddress@Base 0.10
dh_makeshlibs: failing due to earlier errors
make[1]: *** [debian/rules:106: run_dh_makeshlibs] Error 2
make[1]: Leaving directory '/<<PKGBUILDDIR>>'
make: *** [debian/rules:57: binary-arch] Error 2

Tail of log for dxvk on armhf:

Source dir: /<<BUILDDIR>>/dxvk-0.96+ds1
Build dir: /<<BUILDDIR>>/dxvk-0.96+ds1/build-wine32
Build type: cross build
Project name: dxvk
Project version: v0.96
Appending CFLAGS from environment: '-g -O2 -fdebug-prefix-map=/<<BUILDDIR>>/dxvk-0.96+ds1=. -fstack-protector-strong -Wformat -Werror=format-security'
Appending LDFLAGS from environment: '-Wl,-z,relro'
Appending CPPFLAGS from environment: '-Wdate-time -D_FORTIFY_SOURCE=2'

meson.build:1:0: ERROR:  Compiler /usr/lib/wine-development/winegcc can not compile programs.

A full log can be found at /<<BUILDDIR>>/dxvk-0.96+ds1/build-wine32/meson-logs/meson-log.txt
make[1]: *** [debian/rules:32: override_dh_auto_configure] Error 1
make[1]: Leaving directory '/<<BUILDDIR>>/dxvk-0.96+ds1'
make: *** [debian/rules:4: build-arch] Error 2

Tail of log for haskell-type-level on armhf:

    |
266 | instance (DivMod x y q r) => Div x y q
    |          ^^^^^^^^^^^^^^^^^^^^^^^^^^^^^

src/Data/TypeLevel/Num/Ops.hs:336:10: error:
    * Illegal instance declaration for `Div10 x q'
        The liberal coverage condition fails in class `Div10'
          for functional dependency: `q -> x'
        Reason: lhs type `q' does not determine rhs type `x'
        Un-determined variable: x
    * In the instance declaration for `Div10 x q'
    |
336 | instance DivMod10 x q r => Div10 x q
    |          ^^^^^^^^^^^^^^^^^^^^^^^^^^^
make: *** [/usr/share/cdbs/1/class/hlibrary.mk:147: build-ghc-stamp] Error 1

Tail of log for leela-zero on armhf:

/usr/include/c++/8/bits/atomic_base.h:396: undefined reference to `__atomic_load_8'
/usr/bin/ld: CMakeFiles/objs.dir/src/UCTNodePointer.cpp.o: in function `UCTNodePointer::active() const':
/usr/include/c++/8/bits/atomic_base.h:396: undefined reference to `__atomic_load_8'
/usr/bin/ld: CMakeFiles/objs.dir/src/UCTNodePointer.cpp.o: in function `UCTNodePointer::get_eval(int) const':
/usr/include/c++/8/bits/atomic_base.h:396: undefined reference to `__atomic_load_8'
/usr/bin/ld: CMakeFiles/objs.dir/src/UCTNodePointer.cpp.o:/usr/include/c++/8/bits/atomic_base.h:396: more undefined references to `__atomic_load_8' follow
collect2: error: ld returned 1 exit status
make[3]: *** [CMakeFiles/tests.dir/build.make:159: tests] Error 1
make[3]: Leaving directory '/<<PKGBUILDDIR>>/obj-arm-linux-gnueabihf'
make[2]: *** [CMakeFiles/Makefile2:152: CMakeFiles/tests.dir/all] Error 2
make[2]: Leaving directory '/<<PKGBUILDDIR>>/obj-arm-linux-gnueabihf'
make[1]: *** [Makefile:155: all] Error 2
make[1]: Leaving directory '/<<PKGBUILDDIR>>/obj-arm-linux-gnueabihf'
dh_auto_build: cd obj-arm-linux-gnueabihf && make -j4 "INSTALL=install --strip-program=true" returned exit code 2
make: *** [debian/rules:15: build-arch] Error 2

Tail of log for neuron on armhf:

libtool: link: (cd ".libs" && rm -f "libocxt.so" && ln -s "libocxt.so.0.0.0" "libocxt.so")
libtool: link: ( cd ".libs" && rm -f "libocxt.la" && ln -s "../libocxt.la" "libocxt.la" )
make[6]: Leaving directory '/<<PKGBUILDDIR>>/src/oc'
make[5]: *** [Makefile:562: all] Error 2
make[5]: Leaving directory '/<<PKGBUILDDIR>>/src/oc'
make[4]: *** [Makefile:519: all-recursive] Error 1
make[4]: Leaving directory '/<<PKGBUILDDIR>>/src'
make[3]: *** [Makefile:656: all-recursive] Error 1
make[3]: Leaving directory '/<<PKGBUILDDIR>>'
make[2]: *** [Makefile:514: all] Error 2
make[2]: Leaving directory '/<<PKGBUILDDIR>>'
dh_auto_build: make -j4 returned exit code 2
make[1]: *** [debian/rules:32: override_dh_auto_build] Error 2
make[1]: Leaving directory '/<<PKGBUILDDIR>>'
make: *** [debian/rules:15: build-arch] Error 2

Tail of log for qtjsbackend-opensource-src on armhf:

../3rdparty/v8/src/objects.h:7486:36: error: left operand of shift expression '(-8 << 26)' is negative [-fpermissive]
       (~kMaxCachedArrayIndexLength << kArrayIndexHashLengthShift) |
       ~~~~~~~~~~~~~~~~~~~~~~~~~~~~~^~~~~~~~~~~~~~~~~~~~~~~~~~~~~~
make[3]: *** [Makefile:910: .obj/accessors.o] Error 1
make[3]: *** Waiting for unfinished jobs....
make[3]: *** [Makefile:1230: .obj/assembler.o] Error 1
make[3]: *** [Makefile:1348: .obj/ast.o] Error 1
make[3]: *** [Makefile:1083: .obj/api.o] Error 1
make[3]: Leaving directory '/<<PKGBUILDDIR>>/src/v8'
make[2]: *** [Makefile:89: sub-v8-make_first-ordered] Error 2
make[2]: Leaving directory '/<<PKGBUILDDIR>>/src'
make[1]: *** [Makefile:46: sub-src-make_first] Error 2
make[1]: Leaving directory '/<<PKGBUILDDIR>>'
dh_auto_build: make -j4 returned exit code 2
make: *** [debian/rules:14: build-arch] Error 25

Tail of log for tendermint on armhf:

=== RUN   TestBadVotes
--- PASS: TestBadVotes (0.05s)
=== RUN   TestConflicts
--- PASS: TestConflicts (0.07s)
=== RUN   TestMakeCommit
--- PASS: TestMakeCommit (0.09s)
=== RUN   TestVoteSignable
--- PASS: TestVoteSignable (0.00s)
PASS
ok  	github.com/tendermint/tendermint/types	8.716s
?   	github.com/tendermint/tendermint/version	[no test files]
dh_auto_test: cd obj-arm-linux-gnueabihf && go test -vet=off -v -p 1 github.com/tendermint/tendermint/benchmarks github.com/tendermint/tendermint/benchmarks/proto github.com/tendermint/tendermint/benchmarks/simu github.com/tendermint/tendermint/blockchain github.com/tendermint/tendermint/cmd/tendermint github.com/tendermint/tendermint/config/tendermint github.com/tendermint/tendermint/config/tendermint_test github.com/tendermint/tendermint/consensus github.com/tendermint/tendermint/fail-test github.com/tendermint/tendermint/mempool github.com/tendermint/tendermint/node github.com/tendermint/tendermint/proxy github.com/tendermint/tendermint/rpc/core github.com/tendermint/tendermint/rpc/core/types github.com/tendermint/tendermint/rpc/grpc github.com/tendermint/tendermint/rpc/test github.com/tendermint/tendermint/state github.com/tendermint/tendermint/test/app github.com/tendermint/tendermint/types github.com/tendermint/tendermint/version returned exit code 1
make[1]: *** [debian/rules:9: override_dh_auto_test] Error 1
make[1]: Leaving directory '/<<BUILDDIR>>/tendermint-0.8.0+git20170113.0.764091d'
make: *** [debian/rules:6: build-arch] Error 2

Tail of log for wesnoth-1.8 on armhf:

	config/py-compile config.log
find po -name "*.gmo" -exec rm -f {} \;
find po -name "stamp-po" -exec rm -f {} \;
rm -f config.sub config.guess
/usr/bin/make -f /usr/share/quilt/quilt.make unpatch
make[1]: Entering directory '/<<PKGBUILDDIR>>'
QUILT_PATCHES=debian/patches \
	quilt --quiltrc /dev/null pop -a -R || test $? = 2
No patch removed
rm -rf .pc debian/stamp-patched
make[1]: Leaving directory '/<<PKGBUILDDIR>>'
dh_clean
dh_clean: Compatibility levels before 9 are deprecated (level 7 in use)
 debian/rules build-arch
make: *** No rule to make target 'build-arch'.  Stop.

Tail of log for gatb-core on armhf:

  ~~~~~~~~~~~~~~~~~~~~~^~~~~~~~~~~~~~~~~~~~~~~~~
[ 86%] Linking CXX static library ../lib/None/libgatbcore.a
cd /<<BUILDDIR>>/gatb-core-1.4.1+git20181225.44d5a44+dfsg/obj-arm-linux-gnueabihf/src && /usr/bin/cmake -P CMakeFiles/gatbcore-static.dir/cmake_clean_target.cmake
cd /<<BUILDDIR>>/gatb-core-1.4.1+git20181225.44d5a44+dfsg/obj-arm-linux-gnueabihf/src && /usr/bin/cmake -E cmake_link_script CMakeFiles/gatbcore-static.dir/link.txt --verbose=1
/usr/bin/ar qc ../lib/None/libgatbcore.a  CMakeFiles/gatbcore-static.dir/gatb/bank/impl/Bank.cpp.o CMakeFiles/gatbcore-static.dir/gatb/bank/impl/BankAlbum.cpp.o CMakeFiles/gatbcore-static.dir/gatb/bank/impl/BankBinary.cpp.o CMakeFiles/gatbcore-static.dir/gatb/bank/impl/BankConverterAlgorithm.cpp.o CMakeFiles/gatbcore-static.dir/gatb/bank/impl/BankFasta.cpp.o CMakeFiles/gatbcore-static.dir/gatb/bank/impl/BankHelpers.cpp.o CMakeFiles/gatbcore-static.dir/gatb/bank/impl/BankRandom.cpp.o CMakeFiles/gatbcore-static.dir/gatb/bank/impl/BankSplitter.cpp.o CMakeFiles/gatbcore-static.dir/gatb/bcalm2/bcalm_algo.cpp.o CMakeFiles/gatbcore-static.dir/gatb/bcalm2/bglue_algo.cpp.o CMakeFiles/gatbcore-static.dir/gatb/bcalm2/logging.cpp.o CMakeFiles/gatbcore-static.dir/gatb/bcalm2/ograph.cpp.o CMakeFiles/gatbcore-static.dir/gatb/debruijn/impl/BranchingAlgorithm.cpp.o CMakeFiles/gatbcore-static.dir/gatb/debruijn/impl/Frontline.cpp.o CMakeFiles/gatbcore-static.dir/gatb/debruijn/impl/Graph.cpp.o CMakeFiles/gatbcore-static.dir/gatb/debruijn/impl/GraphUnitigs.cpp.o CMakeFiles/gatbcore-static.dir/gatb/debruijn/impl/IterativeExtensions.cpp.o CMakeFiles/gatbcore-static.dir/gatb/debruijn/impl/LinkTigs.cpp.o CMakeFiles/gatbcore-static.dir/gatb/debruijn/impl/Simplifications.cpp.o CMakeFiles/gatbcore-static.dir/gatb/debruijn/impl/Terminator.cpp.o CMakeFiles/gatbcore-static.dir/gatb/debruijn/impl/Traversal.cpp.o CMakeFiles/gatbcore-static.dir/gatb/debruijn/impl/UnitigsConstructionAlgorithm.cpp.o CMakeFiles/gatbcore-static.dir/gatb/kmer/impl/BloomAlgorithm.cpp.o CMakeFiles/gatbcore-static.dir/gatb/kmer/impl/BloomBuilder.cpp.o CMakeFiles/gatbcore-static.dir/gatb/kmer/impl/Configuration.cpp.o CMakeFiles/gatbcore-static.dir/gatb/kmer/impl/ConfigurationAlgorithm.cpp.o CMakeFiles/gatbcore-static.dir/gatb/kmer/impl/DebloomAlgorithm.cpp.o CMakeFiles/gatbcore-static.dir/gatb/kmer/impl/DebloomMinimizerAlgorithm.cpp.o CMakeFiles/gatbcore-static.dir/gatb/kmer/impl/LinearCounter.cpp.o CMakeFiles/gatbcore-static.dir/gatb/kmer/impl/MPHFAlgorithm.cpp.o CMakeFiles/gatbcore-static.dir/gatb/kmer/impl/Model.cpp.o CMakeFiles/gatbcore-static.dir/gatb/kmer/impl/ModelData.cpp.o CMakeFiles/gatbcore-static.dir/gatb/kmer/impl/PartiInfo.cpp.o CMakeFiles/gatbcore-static.dir/gatb/kmer/impl/PartitionsCommand.cpp.o CMakeFiles/gatbcore-static.dir/gatb/kmer/impl/RepartitionAlgorithm.cpp.o CMakeFiles/gatbcore-static.dir/gatb/kmer/impl/SortingCountAlgorithm.cpp.o CMakeFiles/gatbcore-static.dir/gatb/system/impl/FileSystemCommon.cpp.o CMakeFiles/gatbcore-static.dir/gatb/system/impl/FileSystemLinux.cpp.o CMakeFiles/gatbcore-static.dir/gatb/system/impl/FileSystemMacos.cpp.o CMakeFiles/gatbcore-static.dir/gatb/system/impl/System.cpp.o CMakeFiles/gatbcore-static.dir/gatb/system/impl/SystemInfoCommon.cpp.o CMakeFiles/gatbcore-static.dir/gatb/system/impl/ThreadLinux.cpp.o CMakeFiles/gatbcore-static.dir/gatb/system/impl/ThreadMacos.cpp.o CMakeFiles/gatbcore-static.dir/gatb/tools/collections/impl/Bloom.cpp.o CMakeFiles/gatbcore-static.dir/gatb/tools/compression/DnaCoder.cpp.o CMakeFiles/gatbcore-static.dir/gatb/tools/compression/HeaderCoder.cpp.o CMakeFiles/gatbcore-static.dir/gatb/tools/compression/Leon.cpp.o CMakeFiles/gatbcore-static.dir/gatb/tools/compression/RangeCoder.cpp.o CMakeFiles/gatbcore-static.dir/gatb/tools/designpattern/impl/Command.cpp.o CMakeFiles/gatbcore-static.dir/gatb/tools/designpattern/impl/Observer.cpp.o CMakeFiles/gatbcore-static.dir/gatb/tools/misc/api/Data.cpp.o CMakeFiles/gatbcore-static.dir/gatb/tools/misc/impl/Algorithm.cpp.o CMakeFiles/gatbcore-static.dir/gatb/tools/misc/impl/Histogram.cpp.o CMakeFiles/gatbcore-static.dir/gatb/tools/misc/impl/OptionsParser.cpp.o CMakeFiles/gatbcore-static.dir/gatb/tools/misc/impl/Progress.cpp.o CMakeFiles/gatbcore-static.dir/gatb/tools/misc/impl/Property.cpp.o CMakeFiles/gatbcore-static.dir/gatb/tools/misc/impl/TimeInfo.cpp.o CMakeFiles/gatbcore-static.dir/gatb/tools/misc/impl/Tokenizer.cpp.o CMakeFiles/gatbcore-static.dir/gatb/tools/misc/impl/Tool.cpp.o CMakeFiles/gatbcore-static.dir/gatb/tools/misc/impl/XmlReader.cpp.o CMakeFiles/gatbcore-static.dir/gatb/tools/storage/impl/Storage.cpp.o CMakeFiles/gatbcore-static.dir/gatb/tools/storage/impl/StorageTools.cpp.o CMakeFiles/gatbcore-static.dir/gatb/template/TemplateSpecialization1.cpp.in_128.cpp.o CMakeFiles/gatbcore-static.dir/gatb/template/TemplateSpecialization1.cpp.in_32.cpp.o CMakeFiles/gatbcore-static.dir/gatb/template/TemplateSpecialization1.cpp.in_64.cpp.o CMakeFiles/gatbcore-static.dir/gatb/template/TemplateSpecialization1.cpp.in_96.cpp.o CMakeFiles/gatbcore-static.dir/gatb/template/TemplateSpecialization10.cpp.in_128.cpp.o CMakeFiles/gatbcore-static.dir/gatb/template/TemplateSpecialization10.cpp.in_32.cpp.o CMakeFiles/gatbcore-static.dir/gatb/template/TemplateSpecialization10.cpp.in_64.cpp.o CMakeFiles/gatbcore-static.dir/gatb/template/TemplateSpecialization10.cpp.in_96.cpp.o CMakeFiles/gatbcore-static.dir/gatb/template/TemplateSpecialization2.cpp.in_128.cpp.o CMakeFiles/gatbcore-static.dir/gatb/template/TemplateSpecialization2.cpp.in_32.cpp.o CMakeFiles/gatbcore-static.dir/gatb/template/TemplateSpecialization2.cpp.in_64.cpp.o CMakeFiles/gatbcore-static.dir/gatb/template/TemplateSpecialization2.cpp.in_96.cpp.o CMakeFiles/gatbcore-static.dir/gatb/template/TemplateSpecialization3.cpp.in_128.cpp.o CMakeFiles/gatbcore-static.dir/gatb/template/TemplateSpecialization3.cpp.in_32.cpp.o CMakeFiles/gatbcore-static.dir/gatb/template/TemplateSpecialization3.cpp.in_64.cpp.o CMakeFiles/gatbcore-static.dir/gatb/template/TemplateSpecialization3.cpp.in_96.cpp.o CMakeFiles/gatbcore-static.dir/gatb/template/TemplateSpecialization4.cpp.in_128.cpp.o CMakeFiles/gatbcore-static.dir/gatb/template/TemplateSpecialization4.cpp.in_32.cpp.o CMakeFiles/gatbcore-static.dir/gatb/template/TemplateSpecialization4.cpp.in_64.cpp.o CMakeFiles/gatbcore-static.dir/gatb/template/TemplateSpecialization4.cpp.in_96.cpp.o CMakeFiles/gatbcore-static.dir/gatb/template/TemplateSpecialization5.cpp.in_128.cpp.o CMakeFiles/gatbcore-static.dir/gatb/template/TemplateSpecialization5.cpp.in_32.cpp.o CMakeFiles/gatbcore-static.dir/gatb/template/TemplateSpecialization5.cpp.in_64.cpp.o CMakeFiles/gatbcore-static.dir/gatb/template/TemplateSpecialization5.cpp.in_96.cpp.o CMakeFiles/gatbcore-static.dir/gatb/template/TemplateSpecialization6.cpp.in_128.cpp.o CMakeFiles/gatbcore-static.dir/gatb/template/TemplateSpecialization6.cpp.in_32.cpp.o CMakeFiles/gatbcore-static.dir/gatb/template/TemplateSpecialization6.cpp.in_64.cpp.o CMakeFiles/gatbcore-static.dir/gatb/template/TemplateSpecialization6.cpp.in_96.cpp.o CMakeFiles/gatbcore-static.dir/gatb/template/TemplateSpecialization7.cpp.in_128.cpp.o CMakeFiles/gatbcore-static.dir/gatb/template/TemplateSpecialization7.cpp.in_32.cpp.o CMakeFiles/gatbcore-static.dir/gatb/template/TemplateSpecialization7.cpp.in_64.cpp.o CMakeFiles/gatbcore-static.dir/gatb/template/TemplateSpecialization7.cpp.in_96.cpp.o CMakeFiles/gatbcore-static.dir/gatb/template/TemplateSpecialization8.cpp.in_128.cpp.o CMakeFiles/gatbcore-static.dir/gatb/template/TemplateSpecialization8.cpp.in_32.cpp.o CMakeFiles/gatbcore-static.dir/gatb/template/TemplateSpecialization8.cpp.in_64.cpp.o CMakeFiles/gatbcore-static.dir/gatb/template/TemplateSpecialization8.cpp.in_96.cpp.o CMakeFiles/gatbcore-static.dir/gatb/template/TemplateSpecialization9.cpp.in_128.cpp.o CMakeFiles/gatbcore-static.dir/gatb/template/TemplateSpecialization9.cpp.in_32.cpp.o CMakeFiles/gatbcore-static.dir/gatb/template/TemplateSpecialization9.cpp.in_64.cpp.o CMakeFiles/gatbcore-static.dir/gatb/template/TemplateSpecialization9.cpp.in_96.cpp.o
/usr/bin/ranlib ../lib/None/libgatbcore.a
make[4]: Leaving directory '/<<BUILDDIR>>/gatb-core-1.4.1+git20181225.44d5a44+dfsg/obj-arm-linux-gnueabihf'
[ 86%] Built target gatbcore-static
make[3]: Leaving directory '/<<BUILDDIR>>/gatb-core-1.4.1+git20181225.44d5a44+dfsg/obj-arm-linux-gnueabihf'
make[2]: *** [Makefile:155: all] Error 2
make[2]: Leaving directory '/<<BUILDDIR>>/gatb-core-1.4.1+git20181225.44d5a44+dfsg/obj-arm-linux-gnueabihf'
dh_auto_build: cd obj-arm-linux-gnueabihf && make -j4 "INSTALL=install --strip-program=true" returned exit code 2
make[1]: *** [debian/rules:13: override_dh_auto_build-arch] Error 2
make[1]: Leaving directory '/<<BUILDDIR>>/gatb-core-1.4.1+git20181225.44d5a44+dfsg'
make: *** [debian/rules:10: build-arch] Error 2