Raspbian Package Auto-Building

Buildd status for kubrick (buster-staging)

Debian PTSTrackerChangelogBugspackages.d.obuildd.d.o

Package(s): Suite:
Compact mode Co-maintainers

ArchitectureVersionStatusForBuilddStateMiscLogs
Buildd exposure stats armhf  4:18.04.1-1Build-Attempted164d 7h 21mbm-wb-02out-of-datemisc:sourceold | all (22)

Tail of log for kubrick on armhf:

/<<PKGBUILDDIR>>/src/kbkglobal.h:23:27: warning: unnecessary parentheses in declaration of 'm' [-Wparentheses]
 #define LOOP(i,n) for(int ((i))=0; ((i))<((n)); ((i))++)
                           ^
/<<PKGBUILDDIR>>/src/movetracker.cpp:654:2: note: in expansion of macro 'LOOP'
  LOOP (m, nAxes) {
  ^~~~
make[4]: Leaving directory '/<<PKGBUILDDIR>>/obj-arm-linux-gnueabihf'
make[3]: *** [CMakeFiles/Makefile2:1147: src/CMakeFiles/kubrick.dir/all] Error 2
make[3]: Leaving directory '/<<PKGBUILDDIR>>/obj-arm-linux-gnueabihf'
make[2]: *** [Makefile:144: all] Error 2
make[2]: Leaving directory '/<<PKGBUILDDIR>>/obj-arm-linux-gnueabihf'
dh_auto_build: cd obj-arm-linux-gnueabihf && make -j4 "INSTALL=install --strip-program=true" returned exit code 2
make[1]: *** [/usr/share/pkg-kde-tools/qt-kde-team/3/dhmk.mk:97: pre_build-arch_dh_auto_build] Error 2
make[1]: Leaving directory '/<<PKGBUILDDIR>>'
make: *** [/usr/share/pkg-kde-tools/qt-kde-team/3/dhmk.mk:112: debian/dhmk_build-arch] Error 2