Raspbian Package Auto-Building

Buildd status for krita (stretch-staging)

Debian PTSTrackerChangelogBugspackages.d.obuildd.d.o

Package(s): Suite:
Compact mode Co-maintainers

ArchitectureVersionStatusForBuilddStateMiscLogs
Buildd exposure stats armhf  1:3.1.1+dfsg-1Build-Attempted906d 20h 40mtestwandboarduncompiledmisc:sourceold | all (6)

Tail of log for krita on armhf:

/<<BUILDDIR>>/krita-3.1.1+dfsg/libs/ui/opengl/kis_opengl_image_textures.cpp:591:45: error: 'GL_RGBA16' was not declared in this scope
             m_texturesInfo.internalFormat = GL_RGBA16;
                                             ^~~~~~~~~
libs/ui/CMakeFiles/kritaui.dir/build.make:3789: recipe for target 'libs/ui/CMakeFiles/kritaui.dir/opengl/kis_opengl_image_textures.cpp.o' failed
make[3]: *** [libs/ui/CMakeFiles/kritaui.dir/opengl/kis_opengl_image_textures.cpp.o] Error 1
make[3]: Leaving directory '/<<BUILDDIR>>/krita-3.1.1+dfsg/obj-arm-linux-gnueabihf'
CMakeFiles/Makefile2:18345: recipe for target 'libs/ui/CMakeFiles/kritaui.dir/all' failed
make[2]: *** [libs/ui/CMakeFiles/kritaui.dir/all] Error 2
make[2]: Leaving directory '/<<BUILDDIR>>/krita-3.1.1+dfsg/obj-arm-linux-gnueabihf'
Makefile:141: recipe for target 'all' failed
make[1]: *** [all] Error 2
make[1]: Leaving directory '/<<BUILDDIR>>/krita-3.1.1+dfsg/obj-arm-linux-gnueabihf'
dh_auto_build: make -j4 returned exit code 2
debian/rules:18: recipe for target 'build-arch' failed
make: *** [build-arch] Error 2