Raspbian Package Auto-Building

Buildd status for jellyfish (buster-staging)

Debian PTSTrackerChangelogBugspackages.d.obuildd.d.o

Package(s): Suite:
Compact mode Co-maintainers

ArchitectureVersionStatusForBuilddStateMiscLogs
Buildd exposure stats armhf  2.2.10-2Build-Attempted164d 6h 25mmb-lxc-01uncompiledscience:sourceold | all (18)

Tail of log for jellyfish on armhf:

                 from ./include/jellyfish/hash_counter.hpp:22,
                 from sub_commands/count_main.cc:38:
./include/jellyfish/rectangular_binary_matrix.hpp: In member function 'bool jellyfish::RectangularBinaryMatrix::is_zero() const':
./include/jellyfish/rectangular_binary_matrix.hpp:127:29: error: comparison of integer expressions of different signedness: 'int' and 'const unsigned int' [-Werror=sign-compare]
       return (p - _columns) == _c;
              ~~~~~~~~~~~~~~~^~~~~
cc1plus: all warnings being treated as errors
make[3]: *** [Makefile:1749: sub_commands/count_main.o] Error 1
make[3]: Leaving directory '/<<PKGBUILDDIR>>'
make[2]: *** [Makefile:1029: all] Error 2
make[2]: Leaving directory '/<<PKGBUILDDIR>>'
dh_auto_build: make -j1 all bin/generate_sequence bin/test_all bin/fastq2sam returned exit code 2
make[1]: *** [debian/rules:68: override_dh_auto_build] Error 2
make[1]: Leaving directory '/<<PKGBUILDDIR>>'
make: *** [debian/rules:19: build-arch] Error 2