Raspbian Package Auto-Building

Buildd status for jellyfish (bullseye-staging)

Debian PTSTrackerChangelogBugspackages.d.obuildd.d.o

Package(s): Suite:
Compact mode Co-maintainers

ArchitectureVersionStatusForBuilddStateMiscLogs
Buildd exposure stats armhf  2.3.0-6Build-Attempted64d 11h 56mbm-wb-01uncompiledscience:sourceold | all (1)

Tail of log for jellyfish on armhf:

                 from ./include/jellyfish/hash_counter.hpp:14,
                 from sub_commands/count_main.cc:38:
./include/jellyfish/rectangular_binary_matrix.hpp: In member function 'bool jellyfish::RectangularBinaryMatrix::is_zero() const':
./include/jellyfish/rectangular_binary_matrix.hpp:121:29: error: comparison of integer expressions of different signedness: 'int' and 'const unsigned int' [-Werror=sign-compare]
  121 |       return (p - _columns) == _c;
      |              ~~~~~~~~~~~~~~~^~~~~
cc1plus: all warnings being treated as errors
make[3]: *** [Makefile:1710: sub_commands/count_main.o] Error 1
make[3]: Leaving directory '/<<PKGBUILDDIR>>'
make[2]: *** [Makefile:1025: all] Error 2
make[2]: Leaving directory '/<<PKGBUILDDIR>>'
dh_auto_build: error: make -j1 all bin/generate_sequence bin/test_all bin/fastq2sam returned exit code 2
make[1]: *** [debian/rules:78: override_dh_auto_build] Error 25
make[1]: Leaving directory '/<<PKGBUILDDIR>>'
make: *** [debian/rules:21: binary-arch] Error 2