Raspbian Package Auto-Building

Buildd status for intel-processor-trace (stretch-staging)

Debian PTSTrackerChangelogBugspackages.d.obuildd.d.o

Package(s): Suite:
Compact mode Co-maintainers

ArchitectureVersionStatusForBuilddStateMiscLogs
Buildd exposure stats armhf  1.5-1Build-Attempted905d 13h 24mmb-lxc-01uncompiledmisc:sourceold | all (10)

Tail of log for intel-processor-trace on armhf:

                        ^~~~~~~~~
/<<PKGBUILDDIR>>/libipt/src/posix/pt_section_posix.c:114:24: note: each undeclared identifier is reported only once for each function it appears in
libipt/CMakeFiles/libipt.dir/build.make:593: recipe for target 'libipt/CMakeFiles/libipt.dir/src/posix/pt_section_posix.c.o' failed
make[3]: *** [libipt/CMakeFiles/libipt.dir/src/posix/pt_section_posix.c.o] Error 1
make[3]: Leaving directory '/<<PKGBUILDDIR>>/obj-arm-linux-gnueabihf'
CMakeFiles/Makefile2:88: recipe for target 'libipt/CMakeFiles/libipt.dir/all' failed
make[2]: *** [libipt/CMakeFiles/libipt.dir/all] Error 2
make[2]: Leaving directory '/<<PKGBUILDDIR>>/obj-arm-linux-gnueabihf'
Makefile:130: recipe for target 'all' failed
make[1]: *** [all] Error 2
make[1]: Leaving directory '/<<PKGBUILDDIR>>/obj-arm-linux-gnueabihf'
dh_auto_build: make -j1 returned exit code 2
	cd /<<PKGBUILDDIR>>
debian/rules:10: recipe for target 'build-arch' failed
make: *** [build-arch] Error 2