Raspbian Package Auto-Building

Buildd status for idba (stretch-staging)

Debian PTSTrackerChangelogBugspackages.d.obuildd.d.o

Package(s): Suite:
Compact mode Co-maintainers

ArchitectureVersionStatusForBuilddStateMiscLogs
Buildd exposure stats armhf  1.1.3-1Build-Attempted909d 13h 55mbm-wb-04out-of-datemisc:sourceold | all (9)

Tail of log for idba on armhf:

Makefile:891: recipe for target 'test-suite.log' failed
make[4]: *** [test-suite.log] Error 1
make[4]: Leaving directory '/<<PKGBUILDDIR>>/test'
Makefile:997: recipe for target 'check-TESTS' failed
make[3]: *** [check-TESTS] Error 2
make[3]: Leaving directory '/<<PKGBUILDDIR>>/test'
Makefile:1147: recipe for target 'check-am' failed
make[2]: *** [check-am] Error 2
make[2]: Leaving directory '/<<PKGBUILDDIR>>/test'
Makefile:357: recipe for target 'check-recursive' failed
make[1]: *** [check-recursive] Error 1
make[1]: Leaving directory '/<<PKGBUILDDIR>>'
dh_auto_test: make -j4 check VERBOSE=1 returned exit code 2
debian/rules:10: recipe for target 'build-arch' failed
make: *** [build-arch] Error 2