Raspbian Package Auto-Building

Buildd status for icinga2 (bullseye-staging)

Debian PTSTrackerChangelogBugspackages.d.obuildd.d.o

Package(s): Suite:
Compact mode Co-maintainers

ArchitectureVersionStatusForBuilddStateMiscLogs
Buildd exposure stats armhf  2.11.5-1Build-Attempted33d 6h 35mbm-wb-03uncompiledmisc:optionalold | all (1)

Tail of log for icinga2 on armhf:

      |     ^
/<<PKGBUILDDIR>>/lib/icinga/timeperiod.cpp:147:5: note: parameter passing for argument of type 'std::initializer_list<std::pair<const icinga::String, icinga::Value> >' changed in GCC 7.1
  147 |    }));
      |     ^
/<<PKGBUILDDIR>>/lib/icinga/timeperiod.cpp: In member function 'void icinga::TimePeriod::AddSegment(double, double)':
/<<PKGBUILDDIR>>/lib/icinga/timeperiod.cpp:87:3: note: parameter passing for argument of type 'std::initializer_list<std::pair<const icinga::String, icinga::Value> >' changed in GCC 7.1
   87 |  });
      |   ^
make[3]: Leaving directory '/<<PKGBUILDDIR>>/obj-arm-linux-gnueabihf'
[ 64%] Built target icinga
make[2]: Leaving directory '/<<PKGBUILDDIR>>/obj-arm-linux-gnueabihf'
make[1]: *** [Makefile:166: all] Error 2
make[1]: Leaving directory '/<<PKGBUILDDIR>>/obj-arm-linux-gnueabihf'
dh_auto_build: error: cd obj-arm-linux-gnueabihf && make -j4 "INSTALL=install --strip-program=true" returned exit code 2
make: *** [debian/rules:18: build-arch] Error 25