Raspbian Package Auto-Building

Buildd status for iceweasel (stretch-staging)

Debian PTSTrackerChangelogBugspackages.d.obuildd.d.o

Package(s): Suite:
Compact mode Co-maintainers

ArchitectureVersionStatusForBuilddStateMiscLogs
Buildd exposure stats armhf  44.0.2-1Build-Attempted907d 21h 28mbm-wb-02uncompiledweb:sourceold | all (3)

Tail of log for iceweasel on armhf:

configure:29808: checking for posix_fadvise
configure:29840: gcc -o conftest -Wall -Wempty-body -Wpointer-to-int-cast -Wsign-compare -Wtype-limits -Wno-unused -fstack-protector-strong -Wformat -Werror=format-security -std=gnu99 -fgnu89-inline -fno-strict-aliasing -ffunction-sections -fdata-sections -fno-math-errno -pthread -pipe -Wdate-time -D_FORTIFY_SOURCE=2 -lpthread  -Wl,--as-needed -Wl,--reduce-memory-overheads -Wl,--no-keep-memory -Wl,--stats -Wl,-z,noexecstack -Wl,-z,text -Wl,--build-id conftest.c -ldl  1>&5
/usr/bin/ld: total time in link: 0.152000
/usr/bin/ld: data size 2506752
configure:29808: checking for posix_fallocate
configure:29840: gcc -o conftest -Wall -Wempty-body -Wpointer-to-int-cast -Wsign-compare -Wtype-limits -Wno-unused -fstack-protector-strong -Wformat -Werror=format-security -std=gnu99 -fgnu89-inline -fno-strict-aliasing -ffunction-sections -fdata-sections -fno-math-errno -pthread -pipe -Wdate-time -D_FORTIFY_SOURCE=2 -lpthread  -Wl,--as-needed -Wl,--reduce-memory-overheads -Wl,--no-keep-memory -Wl,--stats -Wl,-z,noexecstack -Wl,-z,text -Wl,--build-id conftest.c -ldl  1>&5
/usr/bin/ld: total time in link: 0.156000
/usr/bin/ld: data size 2506752
configure:29894: gcc -c -Wall -Wempty-body -Wpointer-to-int-cast -Wsign-compare -Wtype-limits -Wno-unused -fstack-protector-strong -Wformat -Werror=format-security -std=gnu99 -fgnu89-inline -fno-strict-aliasing -ffunction-sections -fdata-sections -fno-math-errno -pthread -pipe  -Wdate-time -D_FORTIFY_SOURCE=2 conftest.c 1>&5
configure: error: cannot determine icu version number from uvernum.h header file 
debian/rules:212: recipe for target 'stamps/configure-browser' failed
make[1]: *** [stamps/configure-browser] Error 1
make[1]: Leaving directory '/<<PKGBUILDDIR>>'
debian/rules:393: recipe for target 'build-arch' failed
make: *** [build-arch] Error 2