Raspbian Package Auto-Building

Buildd status for selected packages (buster-staging)

Bugs

Package(s): Suite:
Compact mode Co-maintainers

Package armhf
Buildd exposure stats
✘ iannix  Build-Attempted
✔ haskell-protobufBuild-Attempted
✔ gfccoreBuild-Attempted
✔ acoveaBuild-Attempted
✔ asterisk-chan-capiBuild-Attempted
✔ consul-migrateBuild-Attempted
✔ haskell-pretty-simpleBuild-Attempted
✔ libmath-int128-perlBuild-Attempted
✔ libretro-mupen64plusBuild-Attempted
✔ lz4toolsBuild-Attempted
✔ olive-editorBuild-Attempted
✔ slang-slirpBuild-Attempted
✔ unanimityBuild-Attempted
✔ rheolefBuild-Attempted
✘ flatpak  Build-Attempted

Tail of log for iannix on armhf:

./render/uirender.h:253:9: error: 'glColor4f' was not declared in this scope
         glColor4f(color.redF(), color.greenF(), color.blueF(), color.alphaF());
         ^~~~~~~~~
./render/uirender.h:253:9: note: suggested alternative: 'qglColor'
         glColor4f(color.redF(), color.greenF(), color.blueF(), color.alphaF());
         ^~~~~~~~~
         qglColor
make[2]: *** [Makefile:2648: iannixapp.o] Error 1
make[2]: *** Waiting for unfinished jobs....
make[2]: *** [Makefile:2564: iannix.o] Error 1
make[2]: Leaving directory '/<<PKGBUILDDIR>>'
dh_auto_build: make -j4 returned exit code 2
make[1]: *** [debian/rules:32: override_dh_auto_build] Error 25
make[1]: Leaving directory '/<<PKGBUILDDIR>>'
make: *** [debian/rules:28: build-arch] Error 2

Tail of log for haskell-protobuf on armhf:

    fixed32:                                     OK
      +++ OK, passed 100 tests (100% prop_wire :: Fixed Word32).
    fixed64:                                     OK
      +++ OK, passed 100 tests (100% prop_wire :: Fixed Word64).
    sfixed32:                                    OK
      +++ OK, passed 100 tests (100% prop_wire :: Fixed Int32).
    sfixed64:                                    OK
      +++ OK, passed 100 tests (100% prop_wire :: Fixed Int64).
    float:                                       OK (0.01s)
      +++ OK, passed 100 tests (100% prop_wire :: Float).
    double:                                      protobuf-test: SignalException 7
Test suite protobuf-test: FAIL
Test suite logged to: dist-ghc/test/protobuf-0.2.1.2-protobuf-test.log
0 of 1 test suites (0 of 1 test cases) passed.
make: *** [/usr/share/cdbs/1/class/hlibrary.mk:154: check-ghc-stamp] Error 1

Tail of log for gfccore on armhf:

set -e;    
make[1]: Leaving directory '/<<PKGBUILDDIR>>'
if [ "reverse-patches" = "reverse-patches" ]; then rm -f debian/stamp-patched; fi
patches: 
if [ "reverse-patches" != "reverse-patches" ]; then touch debian/stamp-patched; fi
if [ "reverse-patches" != "reverse-patches" ] ; then \
	/usr/bin/make -f debian/rules update-config ; \
fi
for dir in debian/patches ; do \
    rm -f $dir/*.log ; \
done
set -e;    
dh_clean 
dh_clean: Compatibility levels before 5 are no longer supported (level 4 requested)
make: *** [/usr/share/cdbs/1/rules/debhelper.mk:210: clean] Error 25

Tail of log for acovea on armhf:

 fakeroot debian/rules clean
dh_testdir
dh_testroot
rm -f build-stamp 
# Add here commands to clean up after the build process.
/usr/bin/make distclean
make[1]: Entering directory '/<<PKGBUILDDIR>>'
make[1]: *** No rule to make target 'distclean'.  Stop.
make[1]: Leaving directory '/<<PKGBUILDDIR>>'
make: [debian/rules:49: clean] Error 2 (ignored)
cp -f /usr/share/misc/config.sub config.sub
cp -f /usr/share/misc/config.guess config.guess
dh_clean 
dh_clean: Compatibility levels before 5 are no longer supported (level 4 requested)
make: *** [debian/rules:52: clean] Error 25

Tail of log for asterisk-chan-capi on armhf:

  ^~~~~~~~~~~~~~~~~~~~~~~~~~
chan_capi.c:8883:4: warning: implicit declaration of function 'ast_smoother_free'; did you mean 'ast_std_free'? [-Wimplicit-function-declaration]
    ast_smoother_free(i->smoother);
    ^~~~~~~~~~~~~~~~~
    ast_std_free
In file included from chan_capi.h:27,
                 from chan_capi.c:32:
chan_capi.c: In function 'load_module':
chan_capi.c:9009:2: error: 'AST_MODULE_SELF' undeclared (first use in this function); did you mean 'AST_MODULE_INFO'?
  ast_register_application(commandapp, pbx_capicommand_exec, commandsynopsis, commandtdesc);
  ^~~~~~~~~~~~~~~~~~~~~~~~
make[1]: *** [Makefile:198: chan_capi.o] Error 1
make[1]: Leaving directory '/<<PKGBUILDDIR>>'
dh_auto_build: make -j1 returned exit code 2
make: *** [debian/rules:3: build-arch] Error 2

Tail of log for consul-migrate on armhf:

--- FAIL: TestMigrator_data (0.01s)
    migrator_test.go:60: err: MDB_INVALID: File is not an LMDB file
=== RUN   TestMigrator_new
--- PASS: TestMigrator_new (0.00s)
=== RUN   TestMigrator_migrate
--- FAIL: TestMigrator_migrate (0.00s)
    migrator_test.go:130: err: Failed to connect MDB: MDB_INVALID: File is not an LMDB file %!s(MISSING)
=== RUN   TestMigrator_migrate_fails
--- PASS: TestMigrator_migrate_fails (0.63s)
=== RUN   TestMigrator_migrate_noop
--- PASS: TestMigrator_migrate_noop (0.00s)
FAIL
FAIL	github.com/hashicorp/consul-migrate/migrator	0.690s
dh_auto_test: cd obj-arm-linux-gnueabihf && go test -vet=off -v -p 1 github.com/hashicorp/consul-migrate github.com/hashicorp/consul-migrate/migrator returned exit code 1
make: *** [debian/rules:7: build-arch] Error 1

Tail of log for haskell-pretty-simple on armhf:

pretty-simple-doctest:   -Mgrace=<n>
pretty-simple-doctest:             The amount of allocation after the program receives a
pretty-simple-doctest:             HeapOverflow exception before the exception is thrown again, if
pretty-simple-doctest:             the program is still exceeding the heap limit.
pretty-simple-doctest: 
pretty-simple-doctest: RTS options may also be specified using the GHCRTS environment variable.
pretty-simple-doctest: 
pretty-simple-doctest: Other RTS options may be available for programs compiled a different way.
pretty-simple-doctest: The GHC User's Guide has full details.
pretty-simple-doctest: 
Test suite pretty-simple-doctest: FAIL
Test suite logged to:
dist-ghc/test/pretty-simple-2.1.0.1-pretty-simple-doctest.log
0 of 1 test suites (0 of 1 test cases) passed.
make: *** [/usr/share/cdbs/1/class/hlibrary.mk:154: check-ghc-stamp] Error 1

Tail of log for libmath-int128-perl on armhf:

Checking for strings.h... yes
Checking for inttypes.h... yes
Checking for stdint.h... yes
Checking for unistd.h... yes
Checking for uint64_t... yes
Checking for __int128... no
Checking for uint64_t... (cached) yes
Checking for int __attribute__ ((__mode__ (TI)))... 
  It looks like your compiler doesn't support a 128-bit integer type (one of
  "int __attribute__ ((__mode__ (TI)))" or "__int128"). One of these types is
  necessary to compile the Math::Int128 module.

no
dh_auto_configure: perl Makefile.PL INSTALLDIRS=vendor "OPTIMIZE=-g -O2 -fdebug-prefix-map=/<<PKGBUILDDIR>>=. -fstack-protector-strong -Wformat -Werror=format-security -Wdate-time -D_FORTIFY_SOURCE=2" "LD=arm-linux-gnueabihf-gcc -g -O2 -fdebug-prefix-map=/<<PKGBUILDDIR>>=. -fstack-protector-strong -Wformat -Werror=format-security -Wl,-z,relro -Wl,-z,now" returned exit code 1
make: *** [debian/rules:6: build-arch] Error 1

Tail of log for libretro-mupen64plus on armhf:

                 from ./libretro/opengl_state_machine.h:4,
                 from ./libretro/SDL_opengles2.h:29,
                 from gles2rice/src/osal_opengl.h:33,
                 from gles2rice/src/DeviceBuilder.cpp:21:
/usr/include/GLES2/gl2ext.h:2947:16: note: previous declaration as 'typedef double GLdouble'
 typedef double GLdouble;
                ^~~~~~~~
g++ -Wdate-time -D_FORTIFY_SOURCE=2 -g -fdebug-prefix-map=/<<BUILDDIR>>/libretro-mupen64plus-2.0+git20160207+dfsg2=. -fstack-protector-strong -Wformat -Werror=format-security -std=gnu++98 -MMD -O2 -DNDEBUG  -DHAVE_NEON -D__LIBRETRO__ -DINLINE="inline" -DM64P_PLUGIN_API -DM64P_CORE_PROTOTYPES -D_ENDUSER_RELEASE -DSDL_VIDEO_OPENGL_ES2=1 -DSINC_LOWER_QUALITY -DHAVE_COMBINE_EXT  -I./mupen64plus-core/src -I./mupen64plus-core/src/api -I./mupen64plus-core/src/plugin/audio_libretro -I./glide2gl/src/Glitch64/inc -I./libretro-common/include -I./libretro -DARM -fPIC -DARM  -DNO_ASM -DARM -D__arm__ -DARM_ASM -DNOSSE -marm -D__NEON_OPT -mfpu=neon -mfloat-abi=hard -DGLES -DHAVE_OPENGLES2 -DDISABLE_3POINT -DUSE_GLES  -DNEW_DYNAREC=3 -DDYNAREC -c gles2rice/src/FrameBuffer.cpp -o gles2rice/src/FrameBuffer.o
make[2]: *** [Makefile:408: gles2rice/src/DeviceBuilder.o] Error 1
make[2]: *** Waiting for unfinished jobs....
make[2]: Leaving directory '/<<BUILDDIR>>/libretro-mupen64plus-2.0+git20160207+dfsg2'
dh_auto_build: make -j4 "platform=armv gles neon hardfloat" returned exit code 2
make[1]: *** [debian/rules:19: override_dh_auto_build] Error 2
make[1]: Leaving directory '/<<BUILDDIR>>/libretro-mupen64plus-2.0+git20160207+dfsg2'
make: *** [debian/rules:16: build-arch] Error 2

Tail of log for lz4tools on armhf:

                          ^
arm-linux-gnueabihf-gcc -pthread -DNDEBUG -g -fwrapv -O2 -Wall -g -O2 -fdebug-prefix-map=/<<PKGBUILDDIR>>=. -fstack-protector-strong -Wformat -Werror=format-security -Wdate-time -D_FORTIFY_SOURCE=2 -fPIC -I/usr/include/python3.7m -c src/xxhash.c -o build/temp.linux-armhf-3.7/src/xxhash.o -std=c99 -O3 -Wall -W -Wundef -DVERSION="1.3.1.1" -DLZ4_VERSION="r123"
arm-linux-gnueabihf-gcc -pthread -shared -Wl,-O1 -Wl,-Bsymbolic-functions -Wl,-z,relro -Wl,-z,relro -g -O2 -fdebug-prefix-map=/<<PKGBUILDDIR>>=. -fstack-protector-strong -Wformat -Werror=format-security -Wdate-time -D_FORTIFY_SOURCE=2 build/temp.linux-armhf-3.7/src/lz4.o build/temp.linux-armhf-3.7/src/lz4hc.o build/temp.linux-armhf-3.7/src/lz4frame.o build/temp.linux-armhf-3.7/src/python-lz4f.o build/temp.linux-armhf-3.7/src/xxhash.o -o /<<PKGBUILDDIR>>/.pybuild/cpython3_3.7_lz4tools/build/lz4f.cpython-37m-arm-linux-gnueabihf.so
running build_scripts
creating build/scripts-3.7
copying and adjusting lz4toolsCli -> build/scripts-3.7
changing mode of build/scripts-3.7/lz4toolsCli from 664 to 775
   dh_auto_test -a -O--buildsystem=pybuild
I: pybuild pybuild:272: cp -r /<<PKGBUILDDIR>>/tests /<<PKGBUILDDIR>>/.pybuild/cpython3_3.7_lz4tools/build/;cp -r /<<PKGBUILDDIR>>/src /<<PKGBUILDDIR>>/.pybuild/cpython3_3.7_lz4tools/build/
I: pybuild base:217: cd /<<PKGBUILDDIR>>/.pybuild/cpython3_3.7_lz4tools/build; python3.7 -m nose -v tests
test_1_write (test.TestLZ4File) ... ok
test_2_file (test.TestLZ4File) ... Segmentation fault
E: pybuild pybuild:341: test: plugin distutils failed with: exit code=139: cd /<<PKGBUILDDIR>>/.pybuild/cpython3_3.7_lz4tools/build; python3.7 -m nose -v tests
dh_auto_test: pybuild --test --test-nose -i python{version} -p 3.7 returned exit code 13
make: *** [debian/rules:14: build-arch] Error 13

Tail of log for olive-editor on armhf:

                 glPopMatrix();
                 ^~~~~~~~~~~
                 QMatrix
ui/viewerwidget.cpp:899:17: error: 'glColor4f' was not declared in this scope
                 glColor4f(color[0], color[1], color[2], color[3]);
                 ^~~~~~~~~
ui/viewerwidget.cpp:899:17: note: suggested alternative: 'glColorMask'
                 glColor4f(color[0], color[1], color[2], color[3]);
                 ^~~~~~~~~
                 glColorMask
make[1]: *** [Makefile:1461: viewerwidget.o] Error 1
make[1]: *** Waiting for unfinished jobs....
make[1]: Leaving directory '/<<PKGBUILDDIR>>'
dh_auto_build: make -j4 returned exit code 2
make: *** [debian/rules:17: build-arch] Error 25

Tail of log for slang-slirp on armhf:

checking for dlfcn.h... yes
checking for dlopen in -ldl... yes
checking for g++... g++
checking whether we are using the GNU C++ compiler... yes
checking whether g++ accepts -g... yes
checking for gfortran... gfortran
checking whether we are using the GNU Fortran compiler... yes
checking whether gfortran accepts -g... yes
checking how to get verbose linking output from gfortran... -v
checking for Fortran libraries of gfortran...  -L/usr/lib/gcc/arm-linux-gnueabihf/8 -L/usr/lib/gcc/arm-linux-gnueabihf/8/../../../arm-linux-gnueabihf -L/usr/lib/gcc/arm-linux-gnueabihf/8/../../.. -L/lib/arm-linux-gnueabihf -L/usr/lib/arm-linux-gnueabihf -lgfortran -lm
checking for dummy main to link with Fortran libraries... none
checking for Fortran name-mangling scheme... lower case, underscore, no extra underscore
checking for the slang library and header files ... no
configure: error: unable to find the slang library and header file slang.h
make: *** [/usr/share/cdbs/1/class/autotools.mk:46: debian/stamp-autotools] Error 1

Tail of log for unanimity on armhf:

/usr/include/c++/8/bits/stl_vector.h:1085:4: note: parameter passing for argument of type ‘__gnu_cxx::__normal_iterator<PacBio::Align::Seed*, std::vector<PacBio::Align::Seed> >’ changed in GCC 7.1
    _M_realloc_insert(end(), __x);
    ^~~~~~~~~~~~~~~~~
[ 50%] Linking CXX static library libunanimity.a
cd /<<BUILDDIR>>/unanimity-3.3.0+dfsg/build/src && /usr/bin/cmake -P CMakeFiles/unanimity.dir/cmake_clean_target.cmake
cd /<<BUILDDIR>>/unanimity-3.3.0+dfsg/build/src && /usr/bin/cmake -E cmake_link_script CMakeFiles/unanimity.dir/link.txt --verbose=1
/usr/bin/ar qc libunanimity.a  CMakeFiles/unanimity.dir/genomicconsensus/experimental/Consensus.cpp.o CMakeFiles/unanimity.dir/genomicconsensus/experimental/ConsensusModelFactory.cpp.o CMakeFiles/unanimity.dir/genomicconsensus/experimental/Filters.cpp.o CMakeFiles/unanimity.dir/genomicconsensus/experimental/GenomicConsensus.cpp.o CMakeFiles/unanimity.dir/genomicconsensus/experimental/IPoaModel.cpp.o CMakeFiles/unanimity.dir/genomicconsensus/experimental/Input.cpp.o CMakeFiles/unanimity.dir/genomicconsensus/experimental/Intervals.cpp.o CMakeFiles/unanimity.dir/genomicconsensus/experimental/Output.cpp.o CMakeFiles/unanimity.dir/genomicconsensus/experimental/Settings.cpp.o CMakeFiles/unanimity.dir/genomicconsensus/experimental/Sorting.cpp.o CMakeFiles/unanimity.dir/genomicconsensus/experimental/Workflow.cpp.o CMakeFiles/unanimity.dir/genomicconsensus/experimental/arrow/ArrowModel.cpp.o CMakeFiles/unanimity.dir/genomicconsensus/experimental/io/FastaWriter.cpp.o CMakeFiles/unanimity.dir/genomicconsensus/experimental/io/FastqWriter.cpp.o CMakeFiles/unanimity.dir/genomicconsensus/experimental/io/GffWriter.cpp.o CMakeFiles/unanimity.dir/genomicconsensus/experimental/io/VcfWriter.cpp.o CMakeFiles/unanimity.dir/genomicconsensus/experimental/plurality/PluralityModel.cpp.o CMakeFiles/unanimity.dir/genomicconsensus/experimental/poa/PoaModel.cpp.o CMakeFiles/unanimity.dir/ChemistryMapping.cpp.o CMakeFiles/unanimity.dir/ChemistryTriple.cpp.o CMakeFiles/unanimity.dir/Interval.cpp.o CMakeFiles/unanimity.dir/ReadId.cpp.o CMakeFiles/unanimity.dir/SparsePoa.cpp.o CMakeFiles/unanimity.dir/SubreadResultCounter.cpp.o CMakeFiles/unanimity.dir/Timer.cpp.o CMakeFiles/unanimity.dir/Utility.cpp.o CMakeFiles/unanimity.dir/ConsensusSettings.cpp.o
/usr/bin/ranlib libunanimity.a
make[3]: Leaving directory '/<<BUILDDIR>>/unanimity-3.3.0+dfsg/build'
[ 50%] Built target unanimity
make[2]: Leaving directory '/<<BUILDDIR>>/unanimity-3.3.0+dfsg/build'
make[1]: *** [Makefile:133: all] Error 2
make[1]: Leaving directory '/<<BUILDDIR>>/unanimity-3.3.0+dfsg/build'
dh_auto_build: cd build && make -j4 "INSTALL=install --strip-program=true" returned exit code 2
make: *** [debian/rules:28: build-arch] Error 2

Tail of log for rheolef on armhf:

/usr/bin/ld: ../plib/.libs/libfem.a(geo_nearest.o):(.data.rel.ro+0x0): multiple definition of `typeinfo for rheolef::geo_base_rep<double, rheolef::sequential>'; ../plib/.libs/libfem.a(geo.o):(.data.rel.ro+0x0): first defined here
/usr/bin/ld: ../plib/.libs/libfem.a(geo_nearest.o):(.rodata+0x2c): multiple definition of `typeinfo name for rheolef::geo_rep<double, rheolef::sequential>'; ../plib/.libs/libfem.a(geo.o):(.rodata+0x2c): first defined here
/usr/bin/ld: ../plib/.libs/libfem.a(geo_nearest.o):(.data.rel.ro+0xc): multiple definition of `typeinfo for rheolef::geo_rep<double, rheolef::sequential>'; ../plib/.libs/libfem.a(geo.o):(.data.rel.ro+0xc): first defined here
/usr/bin/ld: ../plib/.libs/libfem.a(geo_domain_indirect_seq.o):(.rodata+0x3c): multiple definition of `typeinfo name for rheolef::geo_domain_indirect_rep<double, rheolef::sequential>'; ../plib/.libs/libfem.a(geo_domain_indirect.o):(.rodata+0x0): first defined here
/usr/bin/ld: ../plib/.libs/libfem.a(geo_domain_indirect_seq.o):(.data.rel.ro+0xc): multiple definition of `typeinfo for rheolef::geo_domain_indirect_rep<double, rheolef::sequential>'; ../plib/.libs/libfem.a(geo_domain_indirect.o):(.data.rel.ro+0x0): first defined here
/usr/bin/ld: ../plib/.libs/libfem.a(geo_domain_seq.o):(.rodata+0x0): multiple definition of `typeinfo name for rheolef::geo_rep<double, rheolef::sequential>'; ../plib/.libs/libfem.a(geo.o):(.rodata+0x2c): first defined here
/usr/bin/ld: ../plib/.libs/libfem.a(geo_domain_seq.o):(.data.rel.ro+0x0): multiple definition of `typeinfo for rheolef::geo_rep<double, rheolef::sequential>'; ../plib/.libs/libfem.a(geo.o):(.data.rel.ro+0xc): first defined here
collect2: error: ld returned 1 exit status
make[4]: *** [Makefile:628: librheolef.la] Error 1
make[3]: *** [Makefile:544: all] Error 2
make[2]: *** [Makefile:471: all-recursive] Error 1
make[1]: *** [Makefile:554: all-recursive] Error 1
make[1]: Leaving directory '/<<PKGBUILDDIR>>'
dh_auto_build: make -j1 returned exit code 2
make: *** [debian/rules:30: build-arch] Error 2

Tail of log for flatpak on armhf:

make[6]: *** Deleting file 'tests/test-override.sh.log'
make[6]: *** Deleting file 'tests/test-extensions.sh.log'
make[4]: *** [Makefile:5442: check-am] Terminated
make[2]: *** wait: No child processes.  Stop.
make[2]: *** Waiting for unfinished jobs....
make[2]: *** wait: No child processes.  Stop.
make[6]: *** [Makefile:5166: tests/test-extensions.sh.log] Terminated
make[6]: *** [Makefile:5194: tests/test-override.sh.log] Terminated
make[6]: *** [Makefile:5033: tests/test-run@user,nodeltas.wrap.log] Terminated
make[6]: *** [Makefile:5040: tests/test-run@user,deltas.wrap.log] Terminated
E: Caught signal ‘Terminated’: terminating immediately
make: *** [debian/rules:11: binary-arch] Terminated
make[1]: *** wait: No child processes.  Stop.
make[1]: *** Waiting for unfinished jobs....
make[1]: *** wait: No child processes.  Stop.