Raspbian Package Auto-Building

Buildd status for iannix (buster-staging)

Debian PTSTrackerChangelogBugspackages.d.obuildd.d.o

Package(s): Suite:
Compact mode Co-maintainers

ArchitectureVersionStatusForBuilddStateMiscLogs
Buildd exposure stats armhf  0.9.20~dfsg0-2Build-Attempted164d 8h 9mtestbuilddout-of-datemisc:optionalold | all (25)

Tail of log for iannix on armhf:

./render/uirender.h:253:9: error: 'glColor4f' was not declared in this scope
         glColor4f(color.redF(), color.greenF(), color.blueF(), color.alphaF());
         ^~~~~~~~~
./render/uirender.h:253:9: note: suggested alternative: 'qglColor'
         glColor4f(color.redF(), color.greenF(), color.blueF(), color.alphaF());
         ^~~~~~~~~
         qglColor
make[2]: *** [Makefile:2648: iannixapp.o] Error 1
make[2]: *** Waiting for unfinished jobs....
make[2]: *** [Makefile:2564: iannix.o] Error 1
make[2]: Leaving directory '/<<PKGBUILDDIR>>'
dh_auto_build: make -j4 returned exit code 2
make[1]: *** [debian/rules:32: override_dh_auto_build] Error 25
make[1]: Leaving directory '/<<PKGBUILDDIR>>'
make: *** [debian/rules:28: build-arch] Error 2