Raspbian Package Auto-Building

Buildd status for iannix (bullseye-staging)

Debian PTSTrackerChangelogBugspackages.d.obuildd.d.o

Package(s): Suite:
Compact mode Co-maintainers

ArchitectureVersionStatusForBuilddStateMiscLogs
Buildd exposure stats armhf  0.9.20~dfsg0-2Build-Attempted10d 22h 42mmb-lxc-01out-of-datemisc:optionalold | all (4)

Tail of log for iannix on armhf:

  253 |         glColor4f(color.redF(), color.greenF(), color.blueF(), color.alphaF());
      |         ^~~~~~~~~
      |         qglColor
iannix.cpp: In member function 'virtual QString IanniX::incomingMessage(const MessageIncomming&, bool, bool)':
iannix.cpp:1215:45: warning: enum constant in boolean context [-Wint-in-bool-context]
 1215 |         execute(source, ExecuteSourceNetwork);
      |                                             ^
make[2]: *** [Makefile:2636: iannixapp.o] Error 1
make[2]: *** Waiting for unfinished jobs....
make[2]: *** [Makefile:2552: iannix.o] Error 1
make[2]: Leaving directory '/<<PKGBUILDDIR>>'
dh_auto_build: make -j4 returned exit code 2
make[1]: *** [debian/rules:32: override_dh_auto_build] Error 255
make[1]: Leaving directory '/<<PKGBUILDDIR>>'
make: *** [debian/rules:28: build-arch] Error 2