Raspbian Package Auto-Building

Buildd status for htslib (jessie-staging)

Debian PTSTrackerChangelogBugspackages.d.obuildd.d.o

Package(s): Suite:
Compact mode Co-maintainers

ArchitectureVersionStatusForBuilddStateMiscLogs
Buildd exposure stats armhf  1.1-1Build-Attempted127d 12h 54mbm-wb-04uncompiledmisc:sourceold | all (11)

Tail of log for htslib on armhf:

dh_auto_test
	make -j4 test
make[2]: Entering directory '/<<PKGBUILDDIR>>'
test/fieldarith test/fieldarith.sam
test/hfile
test/sam
Makefile:240: recipe for target 'test' failed
make[2]: *** [test] Bus error
make[2]: Leaving directory '/<<PKGBUILDDIR>>'
dh_auto_test: make -j4 test returned exit code 2
debian/rules:10: recipe for target 'override_dh_auto_test' failed
make[1]: *** [override_dh_auto_test] Error 2
make[1]: Leaving directory '/<<PKGBUILDDIR>>'
debian/rules:7: recipe for target 'build-arch' failed
make: *** [build-arch] Error 2