Raspbian Package Auto-Building

Buildd status for ht (wheezy-staging)

Debian PTSTrackerChangelogBugspackages.d.obuildd.d.o

Package(s): Suite:
Compact mode Co-maintainers

ArchitectureVersionStatusForBuilddStateMiscLogs
Buildd exposure stats armhf  2.0.20-2Build-Attempted1348d 20h 24mbm-wb-01uncompileddevel:sourceold | all (5)

Tail of log for ht on armhf:

        (sign_extend:SI (mem/s:QI (plus:SI (reg/f:SI 169 [ this ])
                    (const_int 600 [0x258])) [6 this_4(D)->disp+0 S1 A64]))) x86dis.cc:276 -1
     (nil))
x86dis.cc:283:1: internal compiler error: in extract_insn, at recog.c:2109
Please submit a full bug report,
with preprocessed source if appropriate.
See <file:///usr/share/doc/gcc-4.6/README.Bugs> for instructions.
Preprocessed source stored into /tmp/ccSfFpp4.out file, please attach this to your bugreport.
make[3]: *** [x86dis.o] Error 1
make[3]: Leaving directory `/<<PKGBUILDDIR>>/asm'
make[2]: *** [all-recursive] Error 1
make[2]: Leaving directory `/<<PKGBUILDDIR>>'
make[1]: *** [all] Error 2
make[1]: Leaving directory `/<<PKGBUILDDIR>>'
make: *** [build-stamp] Error 2