Raspbian Package Auto-Building

Buildd status for selected packages (buster-staging)

Bugs

Package(s): Suite:
Compact mode Co-maintainers

Package armhf
Buildd exposure stats
✔ highwayhashBuild-Attempted
✔ libundeadBuild-Attempted
✔ mrsBuild-Attempted
✔ reprozipBuild-Attempted
✔ qca-cyrus-saslBuild-Attempted
✔ qca2-plugin-osslBuild-Attempted
✔ libqt4pasBuild-Attempted
✔ criuBuild-Attempted
✔ debimanBuild-Attempted
✔ djbdnsBuild-Attempted
✔ dustracBuild-Attempted
✔ fuse-umfuse-iso9660Build-Attempted
✔ gammapyBuild-Attempted
✔ ioappsBuild-Attempted
✔ jellyfishBuild-Attempted
✔ jocamlBuild-Attempted
✔ kpkpassBuild-Attempted
✔ libnunc-stansBuild-Attempted
✔ libsis-jhdf5-javaBuild-Attempted
Package armhf
Buildd exposure stats
✔ listallerBuild-Attempted
✔ mpqc3Build-Attempted
✔ nsd3Build-Attempted
✔ octave-tiseanBuild-Attempted
✔ open-axiomBuild-Attempted
✔ openmpi1.6Build-Attempted
✔ percona-xtradb-cluster-galera-2.xBuild-Attempted
✔ qutecsoundBuild-Attempted
✔ qwinffBuild-Attempted
✔ ruby2.1Build-Attempted
✔ tlsdateBuild-Attempted
✔ traildbBuild-Attempted
✔ tulipBuild-Attempted
✔ wmmailBuild-Attempted
✔ xf86-video-msmBuild-Attempted
✔ pyfftwBuild-Attempted
✘ bashdb  Build-Attempted

Tail of log for highwayhash on armhf:

./highwayhash/profiler.h: In member function 'void highwayhash::Results::UpdateOrAdd(size_t, uint64_t, uint64_t)':
./highwayhash/profiler.h:424:54: warning: left shift count >= width of type [-Wshift-count-overflow]
     zone->num_calls = (biased_offset << Accumulator::kNumCallBits) + num_calls;
                                                      ^~~~~~~~~~~~
./highwayhash/profiler.h: In member function 'void highwayhash::Results::MergeDuplicates()':
./highwayhash/profiler.h:458:42: warning: left shift count >= width of type [-Wshift-count-overflow]
           (biased_offset << Accumulator::kNumCallBits) + num_calls;
                                          ^~~~~~~~~~~~
make[1]: *** [Makefile:52: obj/profiler_example.o] Error 1
make[1]: *** Waiting for unfinished jobs....
make[1]: *** [Makefile:51: obj/nanobenchmark.o] Error 1
rm obj/nanobenchmark_example.o
make[1]: Leaving directory '/<<PKGBUILDDIR>>'
dh_auto_build: make -j4 "INSTALL=install --strip-program=true" returned exit code 2
make: *** [debian/rules:22: build-arch] Error 2

Tail of log for libundead on armhf:

LLVM ERROR: failed to perform tail call elimination on a call site marked musttail
[6/29] ldc2 -I=undead@sha -I=. -I=.. -I=../src/ -enable-color -O -g -release -wi -mattr=-neon -relocation-model=pic   -of='undead@sha/src_undead_dateparse.d.o' -c ../src/undead/dateparse.d
[7/29] ldc2 -I=undead@sha -I=. -I=.. -I=../src/ -enable-color -O -g -release -wi -mattr=-neon -relocation-model=pic   -of='undead@sha/src_undead_date.d.o' -c ../src/undead/date.d
[8/29] ldc2 -I=undead@sha -I=. -I=.. -I=../src/ -enable-color -O -g -release -wi -mattr=-neon -relocation-model=pic   -of='undead@sha/src_undead_regexp.d.o' -c ../src/undead/regexp.d
../src/undead/regexp.d(211): Deprecation: The `delete` keyword has been deprecated.  Use `object.destroy()` (and `core.memory.GC.free()` if applicable) instead.
../src/undead/regexp.d(293): Deprecation: The `delete` keyword has been deprecated.  Use `object.destroy()` (and `core.memory.GC.free()` if applicable) instead.
../src/undead/regexp.d(370): Deprecation: The `delete` keyword has been deprecated.  Use `object.destroy()` (and `core.memory.GC.free()` if applicable) instead.
../src/undead/regexp.d(460): Deprecation: The `delete` keyword has been deprecated.  Use `object.destroy()` (and `core.memory.GC.free()` if applicable) instead.
../src/undead/regexp.d(544): Deprecation: The `delete` keyword has been deprecated.  Use `object.destroy()` (and `core.memory.GC.free()` if applicable) instead.
../src/undead/regexp.d(597): Deprecation: The `delete` keyword has been deprecated.  Use `object.destroy()` (and `core.memory.GC.free()` if applicable) instead.
../src/undead/regexp.d(939): Deprecation: The `delete` keyword has been deprecated.  Use `object.destroy()` (and `core.memory.GC.free()` if applicable) instead.
../src/undead/regexp.d(3021): Deprecation: integral promotion not done for `~prog[i + 1u + 4u + b]`, use '-transition=intpromote' switch or `~cast(int)(prog[i + 1u + 4u + b])`
ninja: build stopped: subcommand failed.
dh_auto_build: cd obj-arm-linux-gnueabihf && LC_ALL=C.UTF-8 ninja -j4 -v returned exit code 1
make: *** [debian/rules:9: build-arch] Error 1

Tail of log for mrs on armhf:

/usr/bin/ld: obj/M6Progress.o: in function `M6Progress::Progress(long long)':
/usr/include/c++/8/bits/atomic_base.h:374: undefined reference to `__atomic_store_8'
/usr/bin/ld: obj/M6Progress.o: in function `M6Progress::~M6Progress()':
/usr/include/c++/8/bits/atomic_base.h:374: undefined reference to `__atomic_store_8'
/usr/bin/ld: obj/M6Progress.o: in function `M6ProgressImpl::PrintProgress()':
/usr/include/c++/8/bits/atomic_base.h:396: undefined reference to `__atomic_load_8'
/usr/bin/ld: obj/M6Progress.o: in function `M6ProgressImpl::Run()':
/usr/include/c++/8/bits/atomic_base.h:396: undefined reference to `__atomic_load_8'
/usr/bin/ld: /usr/include/c++/8/bits/atomic_base.h:396: undefined reference to `__atomic_load_8'
/usr/bin/ld: /usr/include/c++/8/bits/atomic_base.h:396: undefined reference to `__atomic_load_8'
collect2: error: ld returned 1 exit status
make[1]: *** [GNUmakefile:101: mrs] Error 1
make[1]: Leaving directory '/<<BUILDDIR>>/mrs-6.0.5+dfsg'
dh_auto_build: make -j4 returned exit code 2
make: *** [debian/rules:12: build-arch] Error 2

Tail of log for reprozip on armhf:

running build_ext
building 'reprozip._pytracer' extension
creating build
creating build/temp.linux-armhf-3.7
creating build/temp.linux-armhf-3.7/native
arm-linux-gnueabihf-gcc -pthread -DNDEBUG -g -fwrapv -O2 -Wall -g -O2 -fdebug-prefix-map=/<<PKGBUILDDIR>>=. -fstack-protector-strong -Wformat -Werror=format-security -Wdate-time -D_FORTIFY_SOURCE=2 -fPIC -I/usr/include/python3.7m -c native/pytracer.c -o build/temp.linux-armhf-3.7/native/pytracer.o
In file included from native/tracer.h:4,
                 from native/pytracer.c:5:
native/config.h:12:9: error: #error Unrecognized architecture!
 #       error Unrecognized architecture!
         ^~~~~
error: command 'arm-linux-gnueabihf-gcc' failed with exit status 1
E: pybuild pybuild:341: build: plugin distutils failed with: exit code=1: /usr/bin/python3 setup.py build 
dh_auto_build: pybuild --build -i python{version} -p 3.7 returned exit code 13
make: *** [debian/rules:13: build-arch] Error 25

Tail of log for qca-cyrus-sasl on armhf:

dh_auto_test: Compatibility levels before 9 are deprecated (level 7 in use)
 fakeroot debian/rules binary-arch
dh binary-arch 
dh: Compatibility levels before 9 are deprecated (level 7 in use)
   dh_testroot -a
   dh_prep -a
   dh_auto_install -a
dh_auto_install: Compatibility levels before 9 are deprecated (level 7 in use)
	make -j1 install DESTDIR=/<<PKGBUILDDIR>>/debian/libqca2-plugin-cyrus-sasl AM_UPDATE_INFO_DIR=no
make[1]: Entering directory '/<<PKGBUILDDIR>>'
mkdir: cannot create directory '/usr/lib/arm-linux-gnueabihf/qt4/plugins/crypto/': Permission denied
make[1]: *** [Makefile:232: install_target] Error 1
make[1]: Leaving directory '/<<PKGBUILDDIR>>'
dh_auto_install: make -j1 install DESTDIR=/<<PKGBUILDDIR>>/debian/libqca2-plugin-cyrus-sasl AM_UPDATE_INFO_DIR=no returned exit code 2
make: *** [debian/rules:21: binary-arch] Error 2

Tail of log for qca2-plugin-ossl on armhf:

    return new opensslPbkdf2Context( this, type );
                                                ^
qca-ossl.cpp: At global scope:
qca-ossl.cpp:4521:16: warning: 'QString opensslQCAPlugin::cipherIDtoString(const QCA::TLS::Version&, const long unsigned int&)' defined but not used [-Wunused-function]
 static QString cipherIDtoString( const TLS::Version &version, const unsigned long &cipherID)
                ^~~~~~~~~~~~~~~~
qca-ossl.cpp:86:19: warning: 'QCA::BigInteger opensslQCAPlugin::bn2bi(BIGNUM*)' defined but not used [-Wunused-function]
 static BigInteger bn2bi(BIGNUM *n)
                   ^~~~~
make[2]: *** [Makefile:223: qca-ossl.o] Error 1
make[2]: Leaving directory '/<<PKGBUILDDIR>>'
dh_auto_build: make -j4 returned exit code 2
make[1]: *** [/usr/share/pkg-kde-tools/qt-kde-team/2/dhmk.mk:97: pre_build-arch_dh_auto_build] Error 2
make[1]: Leaving directory '/<<PKGBUILDDIR>>'
make: *** [/usr/share/pkg-kde-tools/qt-kde-team/2/dhmk.mk:110: debian/dhmk_build-arch] Error 2

Tail of log for libqt4pas on armhf:

+#MISSING: 2.5-15# (optional=templinst|arch=armel armhf i386 powerpc|subst)_ZN5QListI{qreal}E6appendERK{qreal}@Base 2.5
  (optional=templinst|arch=arm64 armel armhf powerpc ppc64|subst)_ZN5QListI{qreal}ED1Ev@Base 2.5
  (optional=templinst|arch=arm64 armel armhf powerpc ppc64|subst)_ZN5QListI{qreal}ED2Ev@Base 2.5
  (arch=arm64 armel armhf powerpc ppc64)_ZN7QStringD1Ev@Base 2.5
@@ -8570,7 +8570,7 @@
  _ZNK12QDialog_hook10metaObjectEv@Base 2.4
  _ZNK12QLayout_hook10metaObjectEv@Base 2.4
  _ZNK12QObject_hook10metaObjectEv@Base 2.4
- (arch=amd64 arm64 i386 powerpc ppc64 sparc)_ZNK12QPaintDevice7devTypeEv@Base 2.5
+ _ZNK12QPaintDevice7devTypeEv@Base 2.5
  _ZNK12QSlider_hook10metaObjectEv@Base 2.4
  _ZNK12QTabBar_hook10metaObjectEv@Base 2.4
  _ZNK12QThread_hook10metaObjectEv@Base 2.4
dh_makeshlibs: failing due to earlier errors
make: *** [debian/rules:13: binary-arch] Error 2

Tail of log for criu on armhf:

arch/arm/include/asm/atomic.h: At top level:
arch/arm/include/asm/atomic.h:60:2: error: #error ARM architecture version (CONFIG_ARMV*) not set or unsupported.
 #error ARM architecture version (CONFIG_ARMV*) not set or unsupported.
  ^~~~~
arch/arm/include/asm/atomic.h: In function 'atomic_add_return':
arch/arm/include/asm/atomic.h:81:2: error: implicit declaration of function 'smp_mb' [-Werror=implicit-function-declaration]
  smp_mb();
  ^~~~~~
cc1: all warnings being treated as errors
make[2]: *** [scripts/Makefile.build:185: arch/arm/crtools.o] Error 1
make[2]: Leaving directory '/<<PKGBUILDDIR>>'
make[1]: *** [Makefile:208: arch/arm] Error 2
make[1]: Leaving directory '/<<PKGBUILDDIR>>'
dh_auto_build: make -j4 returned exit code 2
make: *** [debian/rules:6: build-arch] Error 2

Tail of log for debiman on armhf:

2019/06/30 15:59:09 path "/cron" -> suite = "", binarypkg = "", name = "cron", section = "", lang = ""
--- PASS: TestCronSection (0.00s)
    --- PASS: TestCronSection/cron (0.00s)
PASS
ok  	github.com/Debian/debiman/internal/redirect	0.018s
=== RUN   TestSitemap
--- PASS: TestSitemap (0.00s)
=== RUN   TestSitemapIndex
--- PASS: TestSitemapIndex (0.00s)
PASS
ok  	github.com/Debian/debiman/internal/sitemap	0.005s
?   	github.com/Debian/debiman/internal/tag	[no test files]
?   	github.com/Debian/debiman/internal/write	[no test files]
dh_auto_test: cd obj-arm-linux-gnueabihf && go test -vet=off -v -p 4 github.com/Debian/debiman github.com/Debian/debiman/cmd/debiman github.com/Debian/debiman/cmd/debiman-auxserver github.com/Debian/debiman/cmd/debiman-idx2rwmap github.com/Debian/debiman/cmd/debiman-minisrv github.com/Debian/debiman/internal/aux github.com/Debian/debiman/internal/bundled github.com/Debian/debiman/internal/commontmpl github.com/Debian/debiman/internal/convert github.com/Debian/debiman/internal/manpage github.com/Debian/debiman/internal/proto github.com/Debian/debiman/internal/recode github.com/Debian/debiman/internal/redirect github.com/Debian/debiman/internal/sitemap github.com/Debian/debiman/internal/tag github.com/Debian/debiman/internal/write returned exit code 1
make: *** [debian/rules:4: binary-arch] Error 1

Tail of log for djbdns on armhf:

 dpkg-source --before-build .
dpkg-buildpackage: info: host architecture armhf
 fakeroot debian/rules clean
rm -f `cat TARGETS`
for i in dbndns/*; do test -d $i || rm -f $i; done
test ! -e patch-stamp || \
  for i in `ls -1r debian/diff/*.diff || :`; do patch -p1 -R <$i; done
rm -f configure-stamp patch-stamp build-stamp \
  dbndns/patch-stamp dbndns/build-stamp
rm -rf '/<<PKGBUILDDIR>>/debian/djbdns' '/<<PKGBUILDDIR>>/debian/dbndns' '/<<PKGBUILDDIR>>/debian/dnscache-run'
rm -f debian/files debian/substvars changelog
test ! -r conf-home'{orig}' || mv -f conf-home'{orig}' conf-home
test ! -r conf-cc'{orig}' || mv conf-cc'{orig}' conf-cc
 debian/rules build-arch
make: *** No rule to make target 'build-arch'.  Stop.

Tail of log for dustrac on armhf:

    Feature record: CXX_FEATURE:0cxx_strong_enums
    Feature record: CXX_FEATURE:1cxx_template_template_parameters
    Feature record: CXX_FEATURE:0cxx_thread_local
    Feature record: CXX_FEATURE:0cxx_trailing_return_types
    Feature record: CXX_FEATURE:0cxx_unicode_literals
    Feature record: CXX_FEATURE:0cxx_uniform_initialization
    Feature record: CXX_FEATURE:0cxx_unrestricted_unions
    Feature record: CXX_FEATURE:0cxx_user_literals
    Feature record: CXX_FEATURE:0cxx_variable_templates
    Feature record: CXX_FEATURE:0cxx_variadic_macros
    Feature record: CXX_FEATURE:0cxx_variadic_templates
dh_auto_configure: cd obj-arm-linux-gnueabihf && cmake -DCMAKE_INSTALL_PREFIX=/usr -DCMAKE_BUILD_TYPE=None -DCMAKE_INSTALL_SYSCONFDIR=/etc -DCMAKE_INSTALL_LOCALSTATEDIR=/var -DCMAKE_EXPORT_NO_PACKAGE_REGISTRY=ON -DCMAKE_FIND_PACKAGE_NO_PACKAGE_REGISTRY=ON "-GUnix Makefiles" -DCMAKE_VERBOSE_MAKEFILE=ON -DCMAKE_INSTALL_LIBDIR=lib/arm-linux-gnueabihf -DReleaseBuild=ON -DBIN_PATH=/usr/games/ -DDOC_PATH=/usr/share/doc/dustracing2d/ -DDATA_PATH=/usr/share/games/dustracing2d/ .. returned exit code 1
make[1]: *** [debian/rules:9: override_dh_auto_configure] Error 2
make[1]: Leaving directory '/<<PKGBUILDDIR>>'
make: *** [debian/rules:6: build-arch] Error 2

Tail of log for fuse-umfuse-iso9660 on armhf:

checking whether the gcc linker (/usr/bin/ld) supports shared libraries... yes
checking whether -lc should be explicitly linked in... no
checking dynamic linker characteristics... GNU/Linux ld.so
checking how to hardcode library paths into programs... immediate
checking whether stripping libraries is possible... yes
checking if libtool supports shared libraries... yes
checking whether to build shared libraries... yes
checking whether to build static libraries... yes
checking for fuse_main in -lfuse... yes
checking for iso9660_open_ext in -liso9660... yes
checking for _cdio_list_begin in -lcdio... yes
checking for uncompress in -lz... yes
checking for um_add_service in -lumlib... no
configure: error: Can't find libumlib, please install it
make: *** [/usr/share/cdbs/1/class/autotools.mk:46: debian/stamp-autotools] Error 1

Tail of log for gammapy on armhf:

mode = 'interp', order = 1

    def _reproject_to_hpx(self, geom, mode="interp", order=1):
        from reproject import reproject_to_healpix
    
>       data = np.empty(geom.data_shape)
E       ValueError: negative dimensions are not allowed

gammapy/maps/wcsnd.py:289: ValueError
======= 45 failed, 896 passed, 447 skipped, 8 xfailed in 269.34 seconds ========
/usr/lib/python3/dist-packages/astropy/config/configuration.py:536: ConfigurationMissingWarning: Configuration defaults will be used due to FileNotFoundError:2 on None
  warn(ConfigurationMissingWarning(msg))
make[1]: *** [debian/rules:21: test-python3.7] Error 1
make[1]: Leaving directory '/<<PKGBUILDDIR>>'
make: *** [debian/rules:9: build-arch] Error 2

Tail of log for ioapps on armhf:

                                    ^
replicate.c:1397:11: note: 'first_call_orig' was declared here
  uint64_t first_call_orig; ///< when was the first original call made
           ^~~~~~~~~~~~~~~
replicate.c:104:36: warning: 'last_call_orig' may be used uninitialized in this function [-Wmaybe-uninitialized]
      diff_orig = CALL_TIME(x##_it) - last_call_orig; \
                                    ^
replicate.c:1396:11: note: 'last_call_orig' was declared here
  uint64_t last_call_orig; ///< when was the last original call made
           ^~~~~~~~~~~~~~
make[2]: *** [Makefile:46: replicate.o] Error 1
make[2]: Leaving directory '/<<PKGBUILDDIR>>'
make[1]: *** [debian/rules:18: override_dh_auto_build] Error 2
make[1]: Leaving directory '/<<PKGBUILDDIR>>'
make: *** [debian/rules:14: build-arch] Error 2

Tail of log for jellyfish on armhf:

                 from ./include/jellyfish/hash_counter.hpp:22,
                 from sub_commands/count_main.cc:38:
./include/jellyfish/rectangular_binary_matrix.hpp: In member function 'bool jellyfish::RectangularBinaryMatrix::is_zero() const':
./include/jellyfish/rectangular_binary_matrix.hpp:127:29: error: comparison of integer expressions of different signedness: 'int' and 'const unsigned int' [-Werror=sign-compare]
       return (p - _columns) == _c;
              ~~~~~~~~~~~~~~~^~~~~
cc1plus: all warnings being treated as errors
make[3]: *** [Makefile:1749: sub_commands/count_main.o] Error 1
make[3]: Leaving directory '/<<PKGBUILDDIR>>'
make[2]: *** [Makefile:1029: all] Error 2
make[2]: Leaving directory '/<<PKGBUILDDIR>>'
dh_auto_build: make -j1 all bin/generate_sequence bin/test_all bin/fastq2sam returned exit code 2
make[1]: *** [debian/rules:68: override_dh_auto_build] Error 2
make[1]: Leaving directory '/<<PKGBUILDDIR>>'
make: *** [debian/rules:19: build-arch] Error 2

Tail of log for jocaml on armhf:

Importing patch ocaml-4.05.0/debian-patches/0005-Avoid-multiple-declarations-in-generated-.c-files-in.patch (stored as debian/patches/0005-Avoid-multiple-declarations-in-generated-.c-files-in.patch)
Skipping ocaml-4.05.0/debian-patches/0004-Put-manpages-in-section-3o-instead-of-3.patch
Importing patch ocaml-4.05.0/debian-patches/0003-Don-t-use-rpath.patch (stored as debian/patches/0003-Don-t-use-rpath.patch)
Importing patch ocaml-4.05.0/debian-patches/0002-Call-ld-with-proper-flags.patch (stored as debian/patches/0002-Call-ld-with-proper-flags.patch)
Importing patch ocaml-4.05.0/debian-patches/0001-Pass-no-relax-to-ld-on-alpha.patch (stored as debian/patches/0001-Pass-no-relax-to-ld-on-alpha.patch)
quilt push -a
Applying patch debian/patches/0001-Pass-no-relax-to-ld-on-alpha.patch
patching file configure
Hunk #1 FAILED at 448.
Hunk #2 FAILED at 982.
2 out of 2 hunks FAILED -- rejects in file configure
Patch debian/patches/0001-Pass-no-relax-to-ld-on-alpha.patch does not apply (enforce with -f)
make[1]: *** [debian/rules:22: override_dh_auto_configure] Error 1
make[1]: Leaving directory '/<<PKGBUILDDIR>>'
make: *** [debian/rules:85: build-arch] Error 2

Tail of log for kpkpass on armhf:

  _ZTSN7KPkPass12BoardingPassE@Base 18.07.90
  _ZTSN7KPkPass4PassE@Base 18.07.90
- (arch=alpha amd64 arm64 armhf hppa hurd-i386 i386 ia64 m68k mips mips64el mipsel powerpc powerpcspe ppc64 ppc64el s390x sh4 sparc64 x32)_ZTSSt11_Mutex_baseILN9__gnu_cxx12_Lock_policyE2EE@Base 18.08.3
- (arch=alpha amd64 arm64 armhf hppa hurd-i386 i386 ia64 m68k mips mips64el mipsel powerpc powerpcspe ppc64 ppc64el s390x sh4 sparc64 x32)_ZTSSt16_Sp_counted_baseILN9__gnu_cxx12_Lock_policyE2EE@Base 18.08.3
+ _ZTSN9__gnu_cxx7__mutexE@Base 18.08.3-2
+ _ZTSSt11_Mutex_baseILN9__gnu_cxx12_Lock_policyE1EE@Base 18.08.3-2
+#MISSING: 18.08.3-2# (arch=alpha amd64 arm64 armhf hppa hurd-i386 i386 ia64 m68k mips mips64el mipsel powerpc powerpcspe ppc64 ppc64el s390x sh4 sparc64 x32)_ZTSSt11_Mutex_baseILN9__gnu_cxx12_Lock_policyE2EE@Base 18.08.3
+ _ZTSSt16_Sp_counted_baseILN9__gnu_cxx12_Lock_policyE1EE@Base 18.08.3-2
+#MISSING: 18.08.3-2# (arch=alpha amd64 arm64 armhf hppa hurd-i386 i386 ia64 m68k mips mips64el mipsel powerpc powerpcspe ppc64 ppc64el s390x sh4 sparc64 x32)_ZTSSt16_Sp_counted_baseILN9__gnu_cxx12_Lock_policyE2EE@Base 18.08.3
  _ZTVN7KPkPass12BoardingPassE@Base 18.07.90
  _ZTVN7KPkPass4PassE@Base 18.07.90
dh_makeshlibs: failing due to earlier errors
make[1]: *** [/usr/share/pkg-kde-tools/qt-kde-team/3/dhmk.mk:97: pre_binary-arch_dh_makeshlibs] Error 2
make[1]: Leaving directory '/<<PKGBUILDDIR>>'
make: *** [/usr/share/pkg-kde-tools/qt-kde-team/3/dhmk.mk:112: debian/dhmk_binary-arch] Error 2

Tail of log for libnunc-stans on armhf:

mkdir -p bin
mkdir -p obj
gcc -MM -std=c99 -I"src" -I"inc" src/abstraction/abstraction_dcas.c >obj/abstraction_dcas.d
gcc -g -O2 -fdebug-prefix-map=/<<PKGBUILDDIR>>=. -fstack-protector-strong -Wformat -Werror=format-security  -c -fpic -Wno-unknown-pragmas -std=c99 -I"src" -I"inc"  -o obj/abstraction_dcas.o src/abstraction/abstraction_dcas.c
/tmp/ccGpCjrq.s: Assembler messages:
/tmp/ccGpCjrq.s:61: Error: selected processor does not support `ldrexd r6,r7,[lr]' in ARM mode
/tmp/ccGpCjrq.s:61: Error: selected processor does not support `strexd r0,r2,r3,[lr]' in ARM mode
make[3]: *** [makefile.linux:79: obj/abstraction_dcas.o] Error 1
make[3]: Leaving directory '/<<PKGBUILDDIR>>/liblfds'
make[2]: *** [Makefile:921: all-recursive] Error 1
make[2]: Leaving directory '/<<PKGBUILDDIR>>'
make[1]: *** [Makefile:646: all] Error 2
make[1]: Leaving directory '/<<PKGBUILDDIR>>'
dh_auto_build: make -j1 returned exit code 2
make: *** [debian/rules:21: build-arch] Error 2

Tail of log for libsis-jhdf5-java on armhf:

[Utils] Attempting to create /<<PKGBUILDDIR>>/test-output/old/All/classes.html
[Utils]   Directory /<<PKGBUILDDIR>>/test-output/old/All exists: true
[Utils] Attempting to create /<<PKGBUILDDIR>>/test-output/old/All/reporter-output.html
[Utils]   Directory /<<PKGBUILDDIR>>/test-output/old/All exists: true
[Utils] Attempting to create /<<PKGBUILDDIR>>/test-output/old/All/methods-not-run.html
[Utils]   Directory /<<PKGBUILDDIR>>/test-output/old/All exists: true
[Utils] Attempting to create /<<PKGBUILDDIR>>/test-output/old/All/testng.xml.html
[Utils]   Directory /<<PKGBUILDDIR>>/test-output/old/All exists: true
[Utils] Attempting to create test-output/old/index.html
[Utils]   Directory test-output/old exists: true
[TestNG] Time taken by org.testng.reporters.SuiteHTMLReporter@79c292: 252 ms
[TestNG] Time taken by org.testng.reporters.jq.Main@1606c0b: 483 ms
make[1]: *** [debian/rules:53: override_dh_auto_test] Error 1
make[1]: Leaving directory '/<<PKGBUILDDIR>>'
make: *** [debian/rules:16: build-arch] Error 2

Tail of log for listaller on armhf:

  Command-line option `--thread` is deprecated and will be ignored

  Compilation failed: 1 error(s), 12 warning(s)



make[3]: *** [src/CMakeFiles/listaller-glib_precompile.dir/build.make:107: src/CMakeFiles/listaller-glib_precompile.dir/precompile.stamp] Error 1
make[3]: Leaving directory '/<<PKGBUILDDIR>>/obj-arm-linux-gnueabihf'
make[2]: *** [CMakeFiles/Makefile2:161: src/CMakeFiles/listaller-glib_precompile.dir/all] Error 2
make[2]: Leaving directory '/<<PKGBUILDDIR>>/obj-arm-linux-gnueabihf'
make[1]: *** [Makefile:144: all] Error 2
make[1]: Leaving directory '/<<PKGBUILDDIR>>/obj-arm-linux-gnueabihf'
dh_auto_build: cd obj-arm-linux-gnueabihf && make -j1 returned exit code 2
make: *** [debian/rules:15: build-arch] Error 2

Tail of log for mpqc3 on armhf:

Source file was:

      #include <libpsio/psio.hpp>
      extern "C" char *gprgid() { return "test"; }
      int main(int argc, char** argv) {
        psi::PSIO psio;
        psio.purge(1);
        return 0;
      }
      
dh_auto_configure: cd obj-arm-linux-gnueabihf && cmake -DCMAKE_INSTALL_PREFIX=/usr -DCMAKE_BUILD_TYPE=None -DCMAKE_INSTALL_SYSCONFDIR=/etc -DCMAKE_INSTALL_LOCALSTATEDIR=/var -DCMAKE_EXPORT_NO_PACKAGE_REGISTRY=ON -DCMAKE_FIND_PACKAGE_NO_PACKAGE_REGISTRY=ON "-GUnix Makefiles" -DCMAKE_VERBOSE_MAKEFILE=ON -DCMAKE_INSTALL_LIBDIR=lib/arm-linux-gnueabihf -DMPI_C_COMPILER=mpicc -DMPQC_NEW_FEATURES=1 -DBOOST=/usr .. returned exit code 1
make[1]: *** [debian/rules:21: override_dh_auto_configure] Error 2
make[1]: Leaving directory '/<<PKGBUILDDIR>>'
make: *** [debian/rules:18: build-arch] Error 2

Tail of log for nsd3 on armhf:

#define FACILITY LOG_DAEMON
#define MAX_INTERFACES 8
#define TCP_TIMEOUT 120
#define ROOT_SERVER /**/
#define INET6 /**/
#define BIND8_STATS /**/
#define NDEBUG /**/
#define RATELIMIT /**/
#define HAVE_SSL /**/

configure: exit 1
dh_auto_configure: ./configure --build=arm-linux-gnueabihf --prefix=/usr --includedir=\${prefix}/include --mandir=\${prefix}/share/man --infodir=\${prefix}/share/info --sysconfdir=/etc --localstatedir=/var --disable-silent-rules --libexecdir=\${prefix}/lib/nsd3 --disable-maintainer-mode --disable-dependency-tracking --with-configdir=/etc/nsd3 --with-nsd_conf_file=/etc/nsd3/nsd.conf --with-pidfile=/var/run/nsd3/nsd.pid --with-dbfile=/var/lib/nsd3/nsd.db --with-zonesdir=/etc/nsd3 --with-difffile=/var/lib/nsd3/ixfr.db --with-xfrdfile=/var/lib/nsd3/xfrd.state --disable-largefile --enable-root-server --enable-mmap --enable-ratelimit returned exit code 1
make[1]: *** [debian/rules:32: override_dh_auto_configure] Error 2
make[1]: Leaving directory '/<<PKGBUILDDIR>>'
make: *** [debian/rules:26: build-arch] Error 2

Tail of log for octave-tisean on armhf:

***** ###############################################################
***** fail("lazy([(1:10);(1:10)],7,-0.06)");
***** fail("lazy((1:10),0,0.04)");
***** fail("[a,b,c] = lazy((1:10),1,0.05)");
***** test
 "In is generated from Octave using 'in = 1 + 0.5 * rand(10,1);'";
 in = [1.47007925526322;1.168775342017635;1.10943000146922; 1.174293926353764;  1.075741574572656; 1.373465364407417; 1.089417388489702; 1.403669883669071;1.452726826806777;  1.016960990335037];
 "res was generated using 'lazy -m1 -v0.06 in.dat' from TISEAN 'lazy'";
 res = [1.47007930, 0.00000000; 1.17153454, -2.75921822E-03; 1.10942996, 0.00000000; 1.17153454, 2.75933743E-03; 1.07574153, 0.00000000; 1.37346542, 0.00000000; 1.08941734, 0.00000000; 1.40366983, 0.00000000; 1.45272684, 0.00000000; 1.01696098, 0.00000000];
 [al,bl] = lazy(in, 1, -0.06);
 assert([al,bl],res,1e-6);
4 tests, 4 passed, 0 known failure, 0 skipped
Summary: 162 tests, 150 passed, 0 known failures, 0 skipped
Some tests failed.  Giving up...
make: *** [debian/rules:5: binary-arch] Error 1

Tail of log for open-axiom on armhf:

/* confdefs.h */
#define PACKAGE_NAME "OpenAxiom"
#define PACKAGE_TARNAME "openaxiom"
#define PACKAGE_VERSION "1.5.0-2013-06-21"
#define PACKAGE_STRING "OpenAxiom 1.5.0-2013-06-21"
#define PACKAGE_BUGREPORT "open-axiom-bugs@lists.sf.net"
#define PACKAGE_URL ""
#define PACKAGE "openaxiom"
#define VERSION "1.5.0-2013-06-21"
#define OPENAXIOM_BASE_RTS Runtime::sbcl

configure: exit 1
dh_auto_configure: cd build-tree && ../configure --build=arm-linux-gnueabihf --prefix=/usr --includedir=\${prefix}/include --mandir=\${prefix}/share/man --infodir=\${prefix}/share/info --sysconfdir=/etc --localstatedir=/var --disable-silent-rules --libexecdir=\${prefix}/lib/open-axiom --disable-maintainer-mode --disable-dependency-tracking --with-lisp=sbcl --with-x --disable-gcl returned exit code 1
make: *** [debian/rules:50: configure-stamp] Error 2

Tail of log for openmpi1.6 on armhf:

atomic-asm.S:107: Error: selected processor does not support `ldrexd r4,r5,[r0]' in ARM mode
atomic-asm.S:112: Error: selected processor does not support `strexd r1,r6,r7,[r0]' in ARM mode
atomic-asm.S:115: Error: selected processor does not support `dmb' in ARM mode
atomic-asm.S:130: Error: selected processor does not support `ldrexd r4,r5,[r0]' in ARM mode
atomic-asm.S:135: Error: selected processor does not support `dmb' in ARM mode
atomic-asm.S:136: Error: selected processor does not support `strexd r1,r6,r7,[r0]' in ARM mode
make[3]: *** [Makefile:1345: atomic-asm.lo] Error 1
make[3]: *** Waiting for unfinished jobs....
make[3]: Leaving directory '/<<PKGBUILDDIR>>/opal/asm'
make[2]: *** [Makefile:2084: all-recursive] Error 1
make[2]: Leaving directory '/<<PKGBUILDDIR>>/opal'
make[1]: *** [Makefile:1383: all-recursive] Error 1
make[1]: Leaving directory '/<<PKGBUILDDIR>>'
dh_auto_build: make -j4 returned exit code 2
make: *** [debian/rules:32: build-arch] Error 2

Tail of log for percona-xtradb-cluster-galera-2.x on armhf:

Checking for C library rt... yes
Checking for C header file sys/epoll.h... yes
Checking for C header file byteswap.h... yes
Checking for C header file endian.h... yes
Checking for C++ header file boost/shared_ptr.hpp... yes
Checking for C++ header file tr1/unordered_map... yes
Checking for C++ library boost_program_options... yes
Checking for __sync_fetch_and_add_8() in C library atomic... yes
Checking for C++ header file asio.hpp... yes
Checking for C++ header file asio/ssl.hpp... no
ssl support required but asio/ssl.hpp not found or not usable
compile with ssl=0 or check that openssl devel headers are usable
make[1]: *** [debian/rules:15: override_dh_auto_build] Error 1
make[1]: Leaving directory '/<<PKGBUILDDIR>>'
make: *** [debian/rules:18: build-arch] Error 2

Tail of log for qutecsound on armhf:

src/csoundengine.cpp:67:35:   required from here
/usr/include/qt4/QtCore/qvector.h:503:25: warning: 'void* memcpy(void*, const void*, size_t)' writing to an object of type 'QVector<QString>::Data' {aka 'struct QVectorTypedData<QString>'} with no trivial copy-assignment; use copy-assignment or copy-initialization instead [-Wclass-memaccess]
                 ::memcpy(x.p, p, sizeOfTypedData() + (qMin(aalloc, d->alloc) - 1) * sizeof(T));
                 ~~~~~~~~^~~~~~~~~~~~~~~~~~~~~~~~~~~~~~~~~~~~~~~~~~~~~~~~~~~~~~~~~~~~~~~~~~~~~~
In file included from /usr/include/qt4/QtCore/qxmlstream.h:50,
                 from /usr/include/qt4/QtCore/QtCore:3,
                 from src/csoundengine.h:26,
                 from src/csoundengine.cpp:23:
/usr/include/qt4/QtCore/qvector.h:94:8: note: 'QVector<QString>::Data' {aka 'struct QVectorTypedData<QString>'} declared here
 struct QVectorTypedData : private QVectorData
        ^~~~~~~~~~~~~~~~
make[1]: *** [Makefile:785: build/doubles/release/obj/csoundengine.o] Error 1
make[1]: *** Waiting for unfinished jobs....
make[1]: Leaving directory '/<<PKGBUILDDIR>>'
make: *** [/usr/share/cdbs/1/class/makefile.mk:77: debian/stamp-makefile-build] Error 2

Tail of log for qwinff on armhf:

src/qmpwidget/qmpwidget.cpp:166:25: note: suggested alternative: 'glVertexAttrib2f'
     glTexCoord2f(0, 0); glVertex2f(-1, -1);
                         ^~~~~~~~~~
                         glVertexAttrib2f
src/qmpwidget/qmpwidget.cpp:170:5: error: 'glEnd' was not declared in this scope
     glEnd();
     ^~~~~
src/qmpwidget/qmpwidget.cpp:170:5: note: suggested alternative: 'glInit'
     glEnd();
     ^~~~~
     glInit
make[1]: *** [Makefile:1155: qmpwidget.o] Error 1
make[1]: Leaving directory '/<<PKGBUILDDIR>>'
dh_auto_build: make -j4 "INSTALL=install --strip-program=true" returned exit code 2
make: *** [debian/rules:17: build-arch] Error 2

Tail of log for ruby2.1 on armhf:

make[4]: Leaving directory '/<<PKGBUILDDIR>>/ext/objspace'
gcc -I. -I../../../.ext/include/arm-linux-gnueabihf -I../../.././include -I../../.././ext/dl/callback -I../../.././ext/dl/callback/.. -DRUBY_EXTCONF_H=\"extconf.h\" -Wdate-time -D_FORTIFY_SOURCE=2 -D_FILE_OFFSET_BITS=64  -fPIC -g -O2 -fdebug-prefix-map=/<<PKGBUILDDIR>>=. -fstack-protector-strong -Wformat -Werror=format-security -fPIC  -o callback-8.o -c callback-8.c
rm -f ../../.ext/arm-linux-gnueabihf/nkf.so
gcc -shared -o ../../.ext/arm-linux-gnueabihf/nkf.so nkf.o -L. -L../.. -L. -Wl,-z,relro -L/<<PKGBUILDDIR>>/debian/lib -fstack-protector -rdynamic -Wl,-export-dynamic    -lruby-2.1  -lpthread -lgmp -ldl -lcrypt -lm   -lc
make[4]: Leaving directory '/<<PKGBUILDDIR>>/ext/nkf'
rm -f ../../../.ext/arm-linux-gnueabihf/dl/callback.so
gcc -shared -o ../../../.ext/arm-linux-gnueabihf/dl/callback.so callback.o callback-0.o callback-1.o callback-2.o callback-3.o callback-4.o callback-5.o callback-6.o callback-7.o callback-8.o -L. -L../../.. -L. -Wl,-z,relro -L/<<PKGBUILDDIR>>/debian/lib -fstack-protector -rdynamic -Wl,-export-dynamic    -lruby-2.1  -lpthread -lgmp -ldl -lcrypt -lm   -lc
make[4]: Leaving directory '/<<PKGBUILDDIR>>/ext/dl/callback'
make[3]: Leaving directory '/<<PKGBUILDDIR>>'
make[2]: *** [uncommon.mk:180: build-ext] Error 2
make[2]: Leaving directory '/<<PKGBUILDDIR>>'
dh_auto_build: make -j4 main V=1 returned exit code 2
make[1]: *** [debian/rules:67: override_dh_auto_build-arch] Error 2
make[1]: Leaving directory '/<<PKGBUILDDIR>>'
make: *** [debian/rules:49: build-arch] Error 2

Tail of log for tlsdate on armhf:

                 from /usr/include/openssl/bio.h:13,
                 from ./src/tlsdate-helper.h:37,
                 from src/tlsdate-helper.c:78:
/usr/include/openssl/ssl.h:1879:1: note: declared here
 DEPRECATEDIN_1_1_0(__owur const SSL_METHOD *TLSv1_client_method(void))
 ^~~~~~~~~~~~~~~~~~
src/tlsdate-helper.c:1207:27: error: dereferencing pointer to incomplete type 'SSL' {aka 'struct ssl_st'}
   memcpy(&result_time, ssl->s3->server_random, sizeof (uint32_t));
                           ^~
make[2]: *** [Makefile:2037: src/tlsdate_helper-tlsdate-helper.o] Error 1
make[2]: Leaving directory '/<<PKGBUILDDIR>>'
make[1]: *** [Makefile:1428: all] Error 2
make[1]: Leaving directory '/<<PKGBUILDDIR>>'
dh_auto_build: make -j1 returned exit code 2
make: *** [debian/rules:25: build-arch] Error 2

Tail of log for traildb on armhf:

#define HAVE_INTTYPES_H 1
#define HAVE_STDINT_H 1
#define HAVE_UNISTD_H 1
#define HAVE_DLFCN_H 1
#define LT_OBJDIR ".libs/"
#define DSFMT_MEXP 521
#define HAVE_SSE2 1
#define HAVE_LIBJUDY 1
#define HAVE_JUDY_H 1
#define HAVE_ARCHIVE_H 1
#define HAVE_LIBARCHIVE 1

configure: exit 1
dh_auto_configure: ./configure --build=arm-linux-gnueabihf --prefix=/usr --includedir=\${prefix}/include --mandir=\${prefix}/share/man --infodir=\${prefix}/share/info --sysconfdir=/etc --localstatedir=/var --disable-silent-rules --libdir=\${prefix}/lib/arm-linux-gnueabihf --libexecdir=\${prefix}/lib/arm-linux-gnueabihf --disable-maintainer-mode --disable-dependency-tracking returned exit code 1
make: *** [debian/rules:10: build-arch] Error 2

Tail of log for tulip on armhf:

     memcpy(this->siblings,siblings,sizeof(int)*this->maxNumberOfElements);
     ^~~~~~
[ 26%] Building CXX object thirdparty/OGDF/CMakeFiles/OGDF-tulip-4.8.dir/src/ogdf/basic/EdgeComparerSimple.cpp.o
cd /<<PKGBUILDDIR>>/obj-arm-linux-gnueabihf/thirdparty/OGDF && /usr/bin/c++  -DOGDF_tulip_4_8_EXPORTS -DQT_CORE_LIB -DQT_GUI_LIB -DQT_NETWORK_LIB -DQT_OPENGL_LIB -DQT_WEBKITWIDGETS_LIB -DQT_WEBKIT_LIB -DQT_WIDGETS_LIB -DQT_XMLPATTERNS_LIB -DQT_XML_LIB -D_LINUX -I/usr/include/arm-linux-gnueabihf/qt5 -I/usr/include/arm-linux-gnueabihf/qt5/QtWidgets -I/usr/include/arm-linux-gnueabihf/qt5/QtGui -I/usr/include/arm-linux-gnueabihf/qt5/QtCore -I/usr/lib/arm-linux-gnueabihf/qt5/mkspecs/linux-g++ -I/usr/include/arm-linux-gnueabihf/qt5/QtOpenGL -I/usr/include/arm-linux-gnueabihf/qt5/QtXml -I/usr/include/arm-linux-gnueabihf/qt5/QtXmlPatterns -I/usr/include/arm-linux-gnueabihf/qt5/QtNetwork -I/usr/include/arm-linux-gnueabihf/qt5/QtWebKit -I/usr/include/arm-linux-gnueabihf/qt5/QtWebKitWidgets -I/<<PKGBUILDDIR>>/thirdparty/OGDF/include -I/<<PKGBUILDDIR>>/thirdparty/OGDF/include/coin -I/<<PKGBUILDDIR>>/thirdparty/OGDF/config/coinstuff  -g -O2 -fdebug-prefix-map=/<<PKGBUILDDIR>>=. -fstack-protector-strong -Wformat -Werror=format-security -Wdate-time -D_FORTIFY_SOURCE=2 -Wall -Wextra -Wunused -Wno-long-long -pedantic -w  -DOGDF_DLL -DOGDF_INSTALL -DCLP_BUILD -DCOINUTILS_BUILD -DOSI_BUILD -DSYMPHONY_BUILD -D__OSI_CLP__ -DCOMPILE_IN_CG -DCOMPILE_IN_CP -DCOMPILE_IN_LP -DCOMPILE_IN_TM -DUSE_CGL_CUTS -DHAVE_CONFIG_H -fPIC   -o CMakeFiles/OGDF-tulip-4.8.dir/src/ogdf/basic/EdgeComparerSimple.cpp.o -c /<<PKGBUILDDIR>>/thirdparty/OGDF/src/ogdf/basic/EdgeComparerSimple.cpp
make[4]: *** [thirdparty/OGDF/CMakeFiles/OGDF-tulip-4.8.dir/build.make:3108: thirdparty/OGDF/CMakeFiles/OGDF-tulip-4.8.dir/src/ogdf/basic/DisjointSets.cpp.o] Error 1
make[4]: *** Waiting for unfinished jobs....
make[4]: Leaving directory '/<<PKGBUILDDIR>>/obj-arm-linux-gnueabihf'
make[3]: *** [CMakeFiles/Makefile2:220: thirdparty/OGDF/CMakeFiles/OGDF-tulip-4.8.dir/all] Error 2
make[3]: Leaving directory '/<<PKGBUILDDIR>>/obj-arm-linux-gnueabihf'
make[2]: *** [Makefile:133: all] Error 2
make[2]: Leaving directory '/<<PKGBUILDDIR>>/obj-arm-linux-gnueabihf'
dh_auto_build: cd obj-arm-linux-gnueabihf && make -j4 returned exit code 2
make[1]: *** [debian/rules:13: override_dh_auto_build-arch] Error 2
make[1]: Leaving directory '/<<PKGBUILDDIR>>'
make: *** [debian/rules:7: build-arch] Error 2

Tail of log for wmmail on armhf:

/usr/bin/make
make[1]: Entering directory '/<<PKGBUILDDIR>>'
Making all in src
make[2]: Entering directory '/<<PKGBUILDDIR>>/src'
gcc -DPACKAGE=\"WMMail\" -DVERSION=\"0.64\" -DHAVE_LIBNSL=1 -DHAVE_LIBX11=1 -DHAVE_LIBXEXT=1 -DHAVE_LIBXT=1 -DHAVE_LIBXPM=1 -DHAVE_LIBWUTIL=1 -DSTDC_HEADERS=1 -DHAVE_LIMITS_H=1 -DHAVE_STRINGS_H=1 -DHAVE_UNISTD_H=1 -DRETSIGTYPE=int -DHAVE_VPRINTF=1 -DHAVE_SOCKET=1 -DHAVE_STRSTR=1  -I. -I.      -g -O2 -I  -c global.c
In file included from global.c:27:
wmmail.h:32:10: fatal error: WINGs/proplist-compat.h: No such file or directory
 #include <WINGs/proplist-compat.h>
          ^~~~~~~~~~~~~~~~~~~~~~~~~
compilation terminated.
make[2]: *** [Makefile:247: global.o] Error 1
make[2]: Leaving directory '/<<PKGBUILDDIR>>/src'
make[1]: *** [Makefile:125: all-recursive] Error 1
make[1]: Leaving directory '/<<PKGBUILDDIR>>'
make: *** [debian/rules:17: build-stamp] Error 2

Tail of log for xf86-video-msm on armhf:

                 from neon_memsets.c:30:
/usr/include/xorg/servermd.h:51:2: error: #error Drivers must include xorg-server.h before any other xserver headers
 #error Drivers must include xorg-server.h before any other xserver headers
  ^~~~~
/usr/include/xorg/servermd.h:52:2: error: #error xserver code must include dix-config.h before any other headers
 #error xserver code must include dix-config.h before any other headers
  ^~~~~
make[3]: *** [Makefile:550: neon_memsets.lo] Error 1
make[3]: Leaving directory '/<<BUILDDIR>>/xf86-video-msm-1.0.1+git20100122.5f7df591/src'
make[2]: *** [Makefile:426: all-recursive] Error 1
make[2]: Leaving directory '/<<BUILDDIR>>/xf86-video-msm-1.0.1+git20100122.5f7df591'
make[1]: *** [Makefile:358: all] Error 2
make[1]: Leaving directory '/<<BUILDDIR>>/xf86-video-msm-1.0.1+git20100122.5f7df591'
dh_auto_build: make -j1 returned exit code 2
make: *** [debian/rules:8: build-arch] Error 2

Tail of log for pyfftw on armhf:

One run: 3.74 ms (versus 11.68 ms for singled threaded)
One run: 4.01 ms (versus 10.45 ms for singled threaded)
One run: 11.12 ms (versus 29.44 ms for numpy.fft)
One run: 11.25 ms (versus 28.59 ms for numpy.fft)
One run: 5.18 ms (versus 28.87 ms for numpy.fft)
One run: 5.16 ms (versus 28.91 ms for numpy.fft)
One run: 11.34 ms (versus 16.75 ms for numpy.fft)
One run: 11.19 ms (versus 16.73 ms for numpy.fft)
One run: 5.38 ms (versus 17.77 ms for numpy.fft)
One run: 5.47 ms (versus 17.65 ms for numpy.fft)
E: pybuild pybuild:341: test: plugin distutils failed with: exit code=1: cd /<<PKGBUILDDIR>>/.pybuild/cpython2_2.7_pyfftw/build; python2.7 -m unittest discover -v 
dh_auto_test: pybuild --test -i python{version} -p 2.7 returned exit code 13
make[1]: *** [debian/rules:36: override_dh_auto_test] Error 1
make[1]: Leaving directory '/<<PKGBUILDDIR>>'
make: *** [debian/rules:15: build-arch] Error 2

BinNMU changelog for bashdb on armhf:

rebuild due to debcheck failure

Tail of log for bashdb on armhf:

#define HAVE_UNISTD_H 1
#define HAVE_UNISTD_H 1
#define HAVE_STRING_H 1
#define HAVE_DLFCN_H 1
#define LT_OBJDIR ".libs/"
#define PACKAGE bashdb
#define VERSION 4.3-0.91
#define PACKAGE bashdb
#define VERSION 4.3-0.91

configure: exit 1
dh_auto_configure: ./configure --build=arm-linux-gnueabihf --prefix=/usr --includedir=\${prefix}/include --mandir=\${prefix}/share/man --infodir=\${prefix}/share/info --sysconfdir=/etc --localstatedir=/var --disable-silent-rules --libdir=\${prefix}/lib/arm-linux-gnueabihf --libexecdir=\${prefix}/lib/arm-linux-gnueabihf --disable-maintainer-mode --disable-dependency-tracking --prefix=/usr --infodir=/usr/share/info --mandir=/usr/share/man --with-bash-src=/usr/include/bash/ returned exit code 1
make[1]: *** [debian/rules:19: override_dh_auto_configure] Error 2
make[1]: Leaving directory '/<<BUILDDIR>>/bashdb-4.3.0.91+ds'
make: *** [debian/rules:16: build-arch] Error 2