Raspbian Package Auto-Building

Buildd status for highwayhash (bullseye-staging)

Debian PTSTrackerChangelogBugspackages.d.obuildd.d.o

Package(s): Suite:
Compact mode Co-maintainers

ArchitectureVersionStatusForBuilddStateMiscLogs
Buildd exposure stats armhf  0~git20200803.9490b14-1Build-Attempted25d 9h 41mbm-wb-03uncompiledmisc:sourceold | all (1)

Tail of log for highwayhash on armhf:

  424 |     zone->num_calls = (biased_offset << Accumulator::kNumCallBits) + num_calls;
      |                        ~~~~~~~~~~~~~~^~~~~~~~~~~~~~~~~~~~~~~~~~~~
./highwayhash/profiler.h: In member function 'void highwayhash::Results::MergeDuplicates()':
./highwayhash/profiler.h:458:26: warning: left shift count >= width of type [-Wshift-count-overflow]
  458 |           (biased_offset << Accumulator::kNumCallBits) + num_calls;
      |            ~~~~~~~~~~~~~~^~~~~~~~~~~~~~~~~~~~~~~~~~~~
g++ -c -Wdate-time -D_FORTIFY_SOURCE=2 -I. -g -O2 -fdebug-prefix-map=/<<PKGBUILDDIR>>=. -fstack-protector-strong -Wformat -Werror=format-security -std=c++11 -Wall -O3 -fPIC -pthread highwayhash/vector_test.cc -o obj/vector_test.o
g++ -c -Wdate-time -D_FORTIFY_SOURCE=2 -I. -g -O2 -fdebug-prefix-map=/<<PKGBUILDDIR>>=. -fstack-protector-strong -Wformat -Werror=format-security -std=c++11 -Wall -O3 -fPIC -pthread highwayhash/vector_test_portable.cc -o obj/vector_test_portable.o
g++ -c -Wdate-time -D_FORTIFY_SOURCE=2 -I. -g -O2 -fdebug-prefix-map=/<<PKGBUILDDIR>>=. -fstack-protector-strong -Wformat -Werror=format-security -std=c++11 -Wall -O3 -fPIC -pthread -mavx2 highwayhash/vector_test_avx2.cc -o obj/vector_test_avx2.o
g++: error: unrecognized command-line option '-mavx2'
make[1]: *** [Makefile:61: obj/vector_test_avx2.o] Error 1
make[1]: *** Waiting for unfinished jobs....
make[1]: Leaving directory '/<<PKGBUILDDIR>>'
dh_auto_build: error: make -j4 "INSTALL=install --strip-program=true" returned exit code 2
make: *** [debian/rules:16: binary-arch] Error 25