Raspbian Package Auto-Building

Buildd status for haskell-gi-pango, pencil2d, asyncpg, fakechroot, pyzmq, git-annex, badger, garagemq, golang-v2ray-core (bullseye-staging)

Bugs

Package(s): Suite:
Compact mode Co-maintainers

Package armhf
Buildd exposure stats
✔ haskell-gi-pangoBuild-Attempted
✘ pencil2d  Build-Attempted
✘ asyncpg  Build-Attempted
✘ fakechroot  Build-Attempted
✘ pyzmq  Build-Attempted
✘ git-annex  Build-Attempted
✔ badgerBuild-Attempted
✔ garagemqBuild-Attempted
✔ golang-v2ray-coreInstalled

Tail of log for haskell-gi-pango on armhf:

[78 of 94] Compiling GI.Pango.Objects.Context ( GI/Pango/Objects/Context.hs, dist-ghc/build/GI/Pango/Objects/Context.o )
[79 of 94] Compiling GI.Pango.Structs.Rectangle[boot] ( GI/Pango/Structs/Rectangle.hs-boot, dist-ghc/build/GI/Pango/Structs/Rectangle.o-boot )
[80 of 94] Compiling GI.Pango.Structs.Matrix ( GI/Pango/Structs/Matrix.hs, dist-ghc/build/GI/Pango/Structs/Matrix.o )
[81 of 94] Compiling GI.Pango.Structs.LayoutLine ( GI/Pango/Structs/LayoutLine.hs, dist-ghc/build/GI/Pango/Structs/LayoutLine.o )
[82 of 94] Compiling GI.Pango.Structs.LayoutIter ( GI/Pango/Structs/LayoutIter.hs, dist-ghc/build/GI/Pango/Structs/LayoutIter.o )
[83 of 94] Compiling GI.Pango.Structs.GlyphString ( GI/Pango/Structs/GlyphString.hs, dist-ghc/build/GI/Pango/Structs/GlyphString.o )
[84 of 94] Compiling GI.Pango.Structs.AttrShape ( GI/Pango/Structs/AttrShape.hs, dist-ghc/build/GI/Pango/Structs/AttrShape.o )
[85 of 94] Compiling GI.Pango.Objects.Font ( GI/Pango/Objects/Font.hs, dist-ghc/build/GI/Pango/Objects/Font.o )

GI/Pango/Objects/Font.hs:670:9: error:
    parse error on input `HarfBuzz.FeatureT.feature_t'
    |
670 |     Ptr HarfBuzz.FeatureT.feature_t ->      -- features : TCArray False (-1) 2 (TInterface (Name {namespace = "HarfBuzz", name = "feature_t"}))
    |         ^^^^^^^^^^^^^^^^^^^^^^^^^^^
make: *** [/usr/share/cdbs/1/class/hlibrary.mk:147: build-ghc-stamp] Error 1

Tail of log for pencil2d on armhf:

  426 |       vector<_Tp, _Alloc>::
      |       ^~~~~~~~~~~~~~~~~~~
/usr/include/c++/10/bits/vector.tcc:426:7: note: parameter passing for argument of type 'std::vector<Catch::SectionEndInfo>::iterator' changed in GCC 7.1
In file included from /usr/include/c++/10/vector:67,
                 from src/catch.hpp:465,
                 from src/main.cpp:18:
/usr/include/c++/10/bits/stl_vector.h: In member function 'virtual void Catch::RunContext::sectionEndedEarly(const Catch::SectionEndInfo&)':
/usr/include/c++/10/bits/stl_vector.h:1198:21: note: parameter passing for argument of type '__gnu_cxx::__normal_iterator<Catch::SectionEndInfo*, std::vector<Catch::SectionEndInfo> >' changed in GCC 7.1
 1198 |    _M_realloc_insert(end(), __x);
      |    ~~~~~~~~~~~~~~~~~^~~~~~~~~~~~
make[2]: Leaving directory '/<<PKGBUILDDIR>>/tests'
make[1]: *** [Makefile:135: sub-tests-make_first-ordered] Error 2
make[1]: Leaving directory '/<<PKGBUILDDIR>>'
dh_auto_build: error: make -j4 returned exit code 2
make: *** [debian/rules:17: binary-arch] Error 25

Tail of log for asyncpg on armhf:

Task was destroyed but it is pending!
task: <Task pending name='Task-1608' coro=<Event.wait() running at /usr/lib/python3.8/asyncio/locks.py:309> wait_for=<Future pending cb=[<TaskWakeupMethWrapper object at 0xb5cef130>()]> cb=[_wait.<locals>._on_completion() at /usr/lib/python3.8/asyncio/tasks.py:507]>
Task was destroyed but it is pending!
task: <Task pending name='Task-1612' coro=<Event.wait() running at /usr/lib/python3.8/asyncio/locks.py:309> wait_for=<Future pending cb=[<TaskWakeupMethWrapper object at 0xb5cefa48>()]> cb=[_wait.<locals>._on_completion() at /usr/lib/python3.8/asyncio/tasks.py:507]>
Task was destroyed but it is pending!
task: <Task pending name='Task-1599' coro=<Connection.proxy_to_backend() running at /<<PKGBUILDDIR>>/.pybuild/cpython3_3.8_asyncpg/build/asyncpg/_testbase/fuzzer.py:260> wait_for=<Future pending cb=[<TaskWakeupMethWrapper object at 0xb5cddd48>()]>>
Task was destroyed but it is pending!
task: <Task pending name='Task-1600' coro=<Connection.proxy_from_backend() running at /<<PKGBUILDDIR>>/.pybuild/cpython3_3.8_asyncpg/build/asyncpg/_testbase/fuzzer.py:286> wait_for=<Future pending cb=[<TaskWakeupMethWrapper object at 0xb5cdd778>()]>>
Task was destroyed but it is pending!
task: <Task pending name='Task-1607' coro=<BaseSelectorEventLoop.sock_recv() running at /usr/lib/python3.8/asyncio/selector_events.py:368> wait_for=<Future pending cb=[BaseSelectorEventLoop._sock_read_done(17)(), <TaskWakeupMethWrapper object at 0xb5cef178>()]>>
Task was destroyed but it is pending!
task: <Task pending name='Task-1611' coro=<BaseSelectorEventLoop.sock_recv() running at /usr/lib/python3.8/asyncio/selector_events.py:368> wait_for=<Future pending cb=[BaseSelectorEventLoop._sock_read_done(18)(), <TaskWakeupMethWrapper object at 0xb5cef988>()]>>
E: pybuild pybuild:352: test: plugin distutils failed with: exit code=1: cd /<<PKGBUILDDIR>>/.pybuild/cpython3_3.8_asyncpg/build; python3.8 -m pytest -k-test_flake8
dh_auto_test: error: pybuild --test --test-pytest -i python{version} -p 3.8 returned exit code 13
make: *** [debian/rules:8: build-arch] Error 25

Tail of log for fakechroot on armhf:

Test Summary Report
-------------------
t/fts.t                   (Wstat: 256 Tests: 40 Failed: 2)
  Failed tests:  39-40
  Non-zero exit status: 1
Files=35, Tests=856, 106 wallclock secs ( 2.01 usr  0.33 sys + 58.59 cusr 114.46 csys = 175.39 CPU)
Result: FAIL
make[3]: *** [Makefile:1325: prove] Error 1
make[3]: Leaving directory '/<<PKGBUILDDIR>>/test'
make[2]: *** [Makefile:1328: test] Error 2
make[2]: Leaving directory '/<<PKGBUILDDIR>>/test'
make[1]: *** [Makefile:864: test] Error 2
make[1]: Leaving directory '/<<PKGBUILDDIR>>'
dh_auto_test: error: make -j4 test VERBOSE=1 returned exit code 2
make: *** [debian/rules:11: build-arch] Error 25

Tail of log for pyzmq on armhf:

zmq/tests/asyncio/test_asyncio.py::TestAsyncIOSocket::test_recv_string PASSED [ 95%]
zmq/tests/asyncio/test_asyncio.py::TestAsyncIOSocket::test_recv_timeout PASSED [ 96%]
zmq/tests/asyncio/test_asyncio.py::TestAsyncIOSocket::test_send_timeout PASSED [ 96%]
zmq/tests/asyncio/test_asyncio.py::TestAsyncIOSocket::test_shadow PASSED [ 96%]
zmq/tests/asyncio/test_asyncio.py::TestAsyncIOSocket::test_socket_class PASSED [ 97%]
zmq/tests/asyncio/test_asyncio.py::TestAsyncioAuthentication::test_blacklist PASSED [ 97%]
zmq/tests/asyncio/test_asyncio.py::TestAsyncioAuthentication::test_curve PASSED [ 98%]
zmq/tests/asyncio/test_asyncio.py::TestAsyncioAuthentication::test_curve_callback PASSED [ 98%]
zmq/tests/asyncio/test_asyncio.py::TestAsyncioAuthentication::test_curve_user_id PASSED [ 98%]
zmq/tests/asyncio/test_asyncio.py::TestAsyncioAuthentication::test_null PASSED [ 99%]
zmq/tests/asyncio/test_asyncio.py::TestAsyncioAuthentication::test_plain 	rm -fr -- /tmp/dh-xdg-rundir-JVQIE5Vn
SCALAR(0x1d98e98)make: *** wait: No child processes.  Stop.
make: *** Waiting for unfinished jobs....
make: *** wait: No child processes.  Stop.
make[1]: *** [debian/rules:36: override_dh_auto_test] Error 4

Tail of log for git-annex on armhf:

Assistant/WebApp/Configurators/Edit.hs:110:83: error:
    * Couldn't match expected type `UUID'
                  with actual type `Git.ConfigKey'
    * In the first argument of `Git.fromConfigKey', namely
        `remotefetch'
      In the first argument of `Param', namely
        `(Git.fromConfigKey remotefetch)'
      In the expression: Param (Git.fromConfigKey remotefetch)
    |
110 |                                         [Param "config", Param (Git.fromConfigKey remotefetch), Param ""]
    |                                                                                   ^^^^^^^^^^^
make[1]: *** [Makefile:56: git-annex] Error 1
make[1]: Leaving directory '/<<PKGBUILDDIR>>'
dh_auto_build: error: make -j1 returned exit code 2
make: *** [debian/rules:31: build-arch] Error 25

Tail of log for badger on armhf:

runtime/trace
net/http/httptrace
net/http
github.com/spf13/cobra
net/http/pprof
expvar
golang.org/x/net/trace
github.com/dgraph-io/badger/y
github.com/dgraph-io/badger/skl
github.com/dgraph-io/badger/table
github.com/dgraph-io/badger
# github.com/dgraph-io/badger
src/github.com/dgraph-io/badger/value.go:50:5: constant 4294967295 overflows int
dh_auto_build: error: cd obj-arm-linux-gnueabihf && go install -trimpath -v -p 4 github.com/dgraph-io/badger/badger github.com/dgraph-io/badger/badger/cmd github.com/dgraph-io/badger/integration/testgc github.com/dgraph-io/badger/options github.com/dgraph-io/badger/pb github.com/dgraph-io/badger/skl github.com/dgraph-io/badger/table github.com/dgraph-io/badger/trie github.com/dgraph-io/badger/y returned exit code 2
make: *** [debian/rules:7: binary-arch] Error 25

Tail of log for garagemq on armhf:

github.com/magiconair/properties
github.com/spf13/afero
expvar
golang.org/x/net/trace
net/http/pprof
github.com/valinurovam/garagemq/protocol
github.com/dgraph-io/badger/y
github.com/spf13/viper
github.com/dgraph-io/badger/skl
github.com/dgraph-io/badger/table
github.com/dgraph-io/badger
# github.com/dgraph-io/badger
src/github.com/dgraph-io/badger/value.go:50:5: constant 4294967295 overflows int
dh_auto_build: error: cd obj-arm-linux-gnueabihf && go install -trimpath -v -p 4 github.com/valinurovam/garagemq github.com/valinurovam/garagemq/admin github.com/valinurovam/garagemq/amqp github.com/valinurovam/garagemq/auth github.com/valinurovam/garagemq/binding github.com/valinurovam/garagemq/config github.com/valinurovam/garagemq/consumer github.com/valinurovam/garagemq/exchange github.com/valinurovam/garagemq/interfaces github.com/valinurovam/garagemq/metrics github.com/valinurovam/garagemq/msgstorage github.com/valinurovam/garagemq/pool github.com/valinurovam/garagemq/protocol github.com/valinurovam/garagemq/qos github.com/valinurovam/garagemq/queue github.com/valinurovam/garagemq/safequeue github.com/valinurovam/garagemq/server github.com/valinurovam/garagemq/srvstorage github.com/valinurovam/garagemq/storage returned exit code 2
make: *** [debian/rules:4: build-arch] Error 25