Raspbian Package Auto-Building

Buildd status for guile-ssh (bullseye-staging)

Debian PTSTrackerChangelogBugspackages.d.obuildd.d.o

Package(s): Suite:
Compact mode Co-maintainers

ArchitectureVersionStatusForBuilddStateMiscLogs
Buildd exposure stats armhf  0.11.3-2Build-Attempted10d 13h 21mtestwandboarduncompiledmisc:sourceold | all (4)

Tail of log for guile-ssh on armhf:

See tests/test-suite.log
Please report to poptsov.artyom@gmail.com
============================================================================
make[5]: *** [Makefile:656: test-suite.log] Error 1
make[5]: Leaving directory '/<<PKGBUILDDIR>>/tests'
make[4]: *** [Makefile:764: check-TESTS] Error 2
make[4]: Leaving directory '/<<PKGBUILDDIR>>/tests'
make[3]: *** [Makefile:830: check-am] Error 2
make[3]: Leaving directory '/<<PKGBUILDDIR>>/tests'
make[2]: *** [Makefile:414: check-recursive] Error 1
make[2]: Leaving directory '/<<PKGBUILDDIR>>'
dh_auto_test: make -j1 check VERBOSE=1 returned exit code 2
make[1]: *** [debian/rules:7: override_dh_auto_test] Error 255
make[1]: Leaving directory '/<<PKGBUILDDIR>>'
make: *** [debian/rules:4: build-arch] Error 2