Raspbian Package Auto-Building

Buildd status for gtk-d (bullseye-staging)

Debian PTSTrackerChangelogBugspackages.d.obuildd.d.o

Package(s): Suite:
Compact mode Co-maintainers

ArchitectureVersionStatusForBuilddStateMiscLogs
Buildd exposure stats armhf  3.9.0-3Build-Attempted15d 19h 14mbm-wb-02uncompiledmisc:sourceold | all (2)

Tail of log for gtk-d on armhf:

/usr/bin/ld: ./libgtkd-3.a(ColorSelection.o): in function `_D3std4conv17__T6toImplTAyaTkZ6toImplFNaNbNekkE3std5ascii10LetterCaseZAya':
./generated/gtkd/gtk/ColorSelection.d:401: multiple definition of `_DT24_D3gtk6Widget6Widget10__mixin37716buildableGetNameMFZAya'; ./libgtkd-3.a(MessageDialog.o):./generated/gtkd/gtk/MessageDialog.d:290: first defined here
/usr/bin/ld: ./libgtkd-3.a(ColorSelection.o): in function `_D3std4conv17__T6toImplTAyaTkZ6toImplFNaNbNekkE3std5ascii10LetterCaseZAya':
./generated/gtkd/gtk/ColorSelection.d:401: multiple definition of `_DT24_D3gtk6Widget6Widget10__mixin37714parserFinishedMFC3gtk7Builder7BuilderZv'; ./libgtkd-3.a(MessageDialog.o):./generated/gtkd/gtk/MessageDialog.d:290: first defined here
/usr/bin/ld: ./libgtkd-3.a(ColorSelection.o): in function `_D3std4conv17__T6toImplTAyaTkZ6toImplFNaNbNekkE3std5ascii10LetterCaseZAya':
./generated/gtkd/gtk/ColorSelection.d:401: multiple definition of `_DT24_D3gtk6Widget6Widget10__mixin37720setBuildablePropertyMFC3gtk7Builder7BuilderAyaC7gobject5Value5ValueZv'; ./libgtkd-3.a(MessageDialog.o):./generated/gtkd/gtk/MessageDialog.d:290: first defined here
/usr/bin/ld: ./libgtkd-3.a(ColorSelection.o): in function `_D3std4conv17__T6toImplTAyaTkZ6toImplFNaNbNekkE3std5ascii10LetterCaseZAya':
./generated/gtkd/gtk/ColorSelection.d:401: multiple definition of `_DT24_D3gtk6Widget6Widget10__mixin37716buildableSetNameMFAyaZv'; ./libgtkd-3.a(MessageDialog.o):./generated/gtkd/gtk/MessageDialog.d:290: first defined here
collect2: error: ld returned 1 exit status
make[2]: *** [GNUmakefile:252: TestWindow] Error 1
make[2]: Leaving directory '/<<PKGBUILDDIR>>'
dh_auto_build: make -j4 "INSTALL=install --strip-program=true" test shared prefix=/usr returned exit code 2
make[1]: *** [debian/rules:19: override_dh_auto_build] Error 255
make[1]: Leaving directory '/<<PKGBUILDDIR>>'
make: *** [debian/rules:16: build-arch] Error 2