Raspbian Package Auto-Building

Buildd status for grpc (stretch-staging)

Debian PTSTrackerChangelogBugspackages.d.obuildd.d.o

Package(s): Suite:
Compact mode Co-maintainers

ArchitectureVersionStatusForBuilddStateMiscLogs
Buildd exposure stats armhf  0.11.1-1Build-Attempted906d 8h 56mmb-lxc-01uncompiledmisc:sourceold | all (21)

Tail of log for grpc on armhf:

[C]       Compiling src/core/security/google_default_credentials.c
[C]       Compiling src/core/security/json_token.c
[C]       Compiling src/core/security/jwt_verifier.c
src/core/security/jwt_verifier.c: In function 'pkey_from_jwk':
src/core/security/jwt_verifier.c:464:10: error: dereferencing pointer to incomplete type 'RSA {aka struct rsa_st}'
       rsa->n = bignum_from_base64(validate_string_field(key_prop, "n"));
          ^~
Makefile:3631: recipe for target '/<<PKGBUILDDIR>>/objs/opt/src/core/security/jwt_verifier.o' failed
make[2]: *** [/<<PKGBUILDDIR>>/objs/opt/src/core/security/jwt_verifier.o] Error 1
make[2]: Leaving directory '/<<PKGBUILDDIR>>'
debian/rules:18: recipe for target 'override_dh_auto_build' failed
make[1]: *** [override_dh_auto_build] Error 2
make[1]: Leaving directory '/<<PKGBUILDDIR>>'
debian/rules:29: recipe for target 'build-arch' failed
make: *** [build-arch] Error 2