Raspbian Package Auto-Building

Buildd status for golang-1.8 (stretch-staging)

Debian PTSTrackerChangelogBugspackages.d.obuildd.d.o

Package(s): Suite:
Compact mode Co-maintainers

ArchitectureVersionStatusForBuilddStateMiscLogs
Buildd exposure stats armhf  1.8.1-1+deb9u1Build-Attempted313d 2h 34mbm-wb-04uncompiledmisc:sourceold | all (1)

Tail of log for golang-1.8 on armhf:

testing: warning: no tests to run
PASS
ok  	_/<<PKGBUILDDIR>>/test/bench/go1	7.849s

##### ../test

##### API check
Go version is "go1.8.1", ignoring -next /<<PKGBUILDDIR>>/api/next.txt

FAILED
debian/rules:57: recipe for target 'override_dh_auto_test-arch' failed
make[1]: *** [override_dh_auto_test-arch] Error 1
make[1]: Leaving directory '/<<PKGBUILDDIR>>'
debian/rules:22: recipe for target 'build-arch' failed
make: *** [build-arch] Error 2