Raspbian Package Auto-Building

Buildd status for selected packages (bullseye-staging)

Bugs

Package(s): Suite:
Compact mode Co-maintainers

Package armhf
Buildd exposure stats
✘ gnome-builder  Build-Attempted
✘ etcd  Build-Attempted
✘ libcereal  Build-Attempted
✔ juceInstalled
✘ pbbam  Build-Attempted
✘ iannix  Build-Attempted
✘ p4est  Build-Attempted
✘ libcec  Build-Attempted
✘ r-cran-httpuv  Build-Attempted
✘ specutils  Build-Attempted
✔ icinga2Build-Attempted
✔ bin-protInstalled
✘ cmus  Build-Attempted
✘ geary  Build-Attempted
✘ r-cran-promises  Build-Attempted
✘ r-cran-samr  Build-Attempted
✘ ruby-debian  Build-Attempted
✘ rust-sysinfo  Build-Attempted
✔ remctlInstalled
Package armhf
Buildd exposure stats
✘ tiledarray  Build-Attempted
✘ socat  Build-Attempted
✔ glib-dBuild-Attempted
✔ thunderbirdInstalled
✔ bagelBuild-Attempted
✘ statsmodels  BD-Uninstallable
✔ haskell-cryptolBuild-Attempted
✔ haskell-protobufBuild-Attempted
✔ highwayhashBuild-Attempted
✔ ismrmrdBuild-Attempted
✔ kvmtoolBuild-Attempted
✔ libsoundioInstalled
✔ libundeadBuild-Attempted
✔ mrsBuild-Attempted
✔ ngs-sdkBuild-Attempted
✔ sumoInstalled
✔ gfccoreBuild-Attempted
✔ poclBuild-Attempted
✔ reprozipBuild-Attempted
✔ libibcmBuild-Attempted
Package armhf
Buildd exposure stats
✔ libqglviewerBuild-Attempted
✔ acoveaBuild-Attempted
✔ mingw32-binutilsBuild-Attempted
✔ ocamlgslBuild-Attempted
✔ asterisk-chan-capiBuild-Attempted
✔ apfBuild-Attempted
✔ austinBuild-Attempted
✔ audacious-analog-vumeter-pluginBuild-Attempted
✘ wine  Needs-Build
✔ autofs5Build-Attempted
✔ criuBuild-Attempted
✔ consul-migrateBuild-Attempted
✔ cryptominisatBuild-Attempted
✔ djbdnsBuild-Attempted
✔ blastemBuild-Attempted
✔ dustracBuild-Attempted
✔ debimanBuild-Attempted
✔ ezquakeBuild-Attempted
✔ dxvkBuild-Attempted
✔ fuse-umfuse-iso9660Build-Attempted
Package armhf
Buildd exposure stats
✔ febootstrapBuild-Attempted
✔ golang-github-anacrolix-missinggoBuild-Attempted
✔ gatb-coreBuild-Attempted
✔ guile-sshBuild-Attempted
✔ libqt4pasBuild-Attempted
✔ haskell-heterocephalusBuild-Attempted
✔ gammapyBuild-Attempted
✔ gr-hpsdrBuilt
✔ haskell-type-levelBuild-Attempted
✔ haskell-pretty-simpleBuild-Attempted
✔ jellyfishnot in w-b
✔ ioappsBuild-Attempted
✔ ibamBuild-Attempted
✔ jocamlBuild-Attempted
✔ kpkpassInstalled
✔ libmath-int128-perlBuild-Attempted
✔ libmlx5Build-Attempted
✔ libretro-mupen64plusBuild-Attempted
✔ libnunc-stansBuild-Attempted
✔ lib3mfBuild-Attempted
Package armhf
Buildd exposure stats
✔ libtangoBuild-Attempted
✔ libsis-jhdf5-javaBuild-Attempted
✔ mariadb-connector-odbcBuild-Attempted
✔ libxsmmBuild-Attempted
✔ mpqc3Build-Attempted
✔ msrtoolBuild-Attempted
✔ mensisBuild-Attempted
✔ listallerBuild-Attempted
✔ nsd3Build-Attempted
✔ neuronBuild-Attempted
✔ open-axiomBuild-Attempted
✔ openmpi1.6Build-Attempted
✔ oliveBuild-Attempted
✔ leela-zeroBuild-Attempted
✔ olive-editorBuild-Attempted
✔ pgsql-ogr-fdwInstalled
✘ rust-quick-xml  Build-Attempted
✔ percona-xtradb-cluster-galera-2.xBuild-Attempted
✔ perftestBuild-Attempted
✔ osrmBuild-Attempted
Package armhf
Buildd exposure stats
✔ qtjsbackend-opensource-srcBuild-Attempted
✔ qutecsoundBuild-Attempted
✔ prboomBuild-Attempted
✔ qwinffBuild-Attempted
✔ rpm2htmlBuild-Attempted
✔ ruby-strptimeBuild-Attempted
✔ rust-mach-o-sysBuild-Attempted
✔ rust-kvm-ioctlsBuild-Attempted
✔ qtoxBuild-Attempted
✔ ruby2.1Build-Attempted
✘ r-cran-treespace  Build-Attempted
✔ rust-mysqlclient-sysBuild-Attempted
✔ rust-pq-sysBuild-Attempted
✔ rust-ucd-generateBuild-Attempted
✔ scanbuttondBuild-Attempted
✔ tarantoolBuild-Attempted
✔ slang-slirpBuild-Attempted
✔ traildbBuild-Attempted
✔ tlsdateBuild-Attempted
✔ wham-alignBuild-Attempted
Package armhf
Buildd exposure stats
✔ tendermintBuild-Attempted
✔ wmmailBuild-Attempted
✔ wesnoth-1.8Build-Attempted
✔ xf86-video-msmBuild-Attempted
✔ tulipBuild-Attempted
✔ iem-plugin-suiteBuild-Attempted
✔ asebaBuild-Attempted
✔ octave-tiseanBuild-Attempted
✔ bbmapInstalled
✔ ardour3Build-Attempted
✔ gffreadBuild-Attempted
✔ vmemcacheBuild-Attempted
✔ unanimityBuild-Attempted
✔ coneBuild-Attempted
✔ haskell-genvalidity-hspecBuild-Attempted
✔ haskell-githashInstalled
✔ valentinaBuild-Attempted
✔ pyfftwBuild-Attempted
✔ agdaBuild-Attempted
✔ orpieBD-Uninstallable
Package armhf
Buildd exposure stats
✔ rheolefBuild-Attempted
✔ mrtrix3Build-Attempted
✔ gtk-dBuild-Attempted
✔ flangBuild-Attempted
✔ mameInstalled
✔ vimInstalled
✔ kubrickBuild-Attempted
✔ python-pyprojInstalled
✔ ibusInstalled
✔ chromium-browserBuild-Attempted
✔ appstream-generatorBuild-Attempted
✔ colmapBuild-Attempted
✔ haxeInstalled
✔ cclsBuild-Attempted
✔ brialInstalled
✔ haskell-config-iniInstalled
✔ hedgewarsInstalled
✘ python-apsw  Build-Attempted
✔ dartInstalled

Tail of log for gnome-builder on armhf:

CMake binary for MachineChoice.HOST is not cached
CMake binary missing from cross or native file, or env var undefined.
Trying a default CMake fallback at cmake
Trying CMake binary cmake for machine MachineChoice.HOST at [None]
Did not find CMake 'cmake'
Found CMake: NO
No CMake binary for machine MachineChoice.HOST not found. Giving up.
Run-time dependency libvala-0.46 found: NO (tried pkgconfig)

src/plugins/vala-pack/meson.build:7:0: ERROR: Dependency "libvala-0.46" not found, tried pkgconfig
dh_auto_configure: cd obj-arm-linux-gnueabihf && LC_ALL=C.UTF-8 meson .. --wrap-mode=nodownload --buildtype=plain --prefix=/usr --sysconfdir=/etc --localstatedir=/var --libdir=lib/arm-linux-gnueabihf -Dnetwork_tests=false -Dplugin_flatpak=true -Dplugin_sysprof=true -Dplugin_valgrind=true returned exit code 1
make[1]: *** [debian/rules:34: override_dh_auto_configure] Error 255
make[1]: Leaving directory '/<<PKGBUILDDIR>>'
make: *** [debian/rules:31: binary-arch] Error 2

Tail of log for etcd on armhf:

github.com/coreos/etcd/functional/rpcpb
github.com/coreos/etcd/pkg/proxy
github.com/coreos/etcd/functional/tester
github.com/coreos/etcd/functional/agent
github.com/coreos/etcd/functional/cmd/etcd-agent
github.com/coreos/etcd/functional/cmd/etcd-proxy
github.com/coreos/etcd/functional/cmd/etcd-tester
github.com/coreos/etcd/pkg/testutil
net/http/httptest
github.com/coreos/etcd/pkg/mock/mockstorage
github.com/coreos/etcd/pkg/mock/mockstore
github.com/coreos/etcd/pkg/mock/mockwait
github.com/coreos/etcd/raft/rafttest
dh_auto_build: cd _build && go install -gcflags=all=\"-trimpath=/<<BUILDDIR>>/etcd-3.2.26\+dfsg/_build/src\" -asmflags=all=\"-trimpath=/<<BUILDDIR>>/etcd-3.2.26\+dfsg/_build/src\" -v -p 4 github.com/coreos/etcd github.com/coreos/etcd/alarm github.com/coreos/etcd/auth github.com/coreos/etcd/auth/authpb github.com/coreos/etcd/client github.com/coreos/etcd/client/integration github.com/coreos/etcd/clientv3 github.com/coreos/etcd/clientv3/clientv3util github.com/coreos/etcd/clientv3/concurrency github.com/coreos/etcd/clientv3/integration github.com/coreos/etcd/clientv3/mirror github.com/coreos/etcd/clientv3/namespace github.com/coreos/etcd/clientv3/naming github.com/coreos/etcd/clientv3/yaml github.com/coreos/etcd/compactor github.com/coreos/etcd/contrib/raftexample github.com/coreos/etcd/contrib/recipes github.com/coreos/etcd/contrib/systemd/etcd2-backup-coreos github.com/coreos/etcd/discovery github.com/coreos/etcd/e2e github.com/coreos/etcd/embed github.com/coreos/etcd/error github.com/coreos/etcd/etcdctl github.com/coreos/etcd/etcdctl/ctlv2 github.com/coreos/etcd/etcdctl/ctlv2/command github.com/coreos/etcd/etcdctl/ctlv3 github.com/coreos/etcd/etcdctl/ctlv3/command github.com/coreos/etcd/etcdmain github.com/coreos/etcd/etcdserver github.com/coreos/etcd/etcdserver/api github.com/coreos/etcd/etcdserver/api/etcdhttp github.com/coreos/etcd/etcdserver/api/v2http github.com/coreos/etcd/etcdserver/api/v2http/httptypes github.com/coreos/etcd/etcdserver/api/v3client github.com/coreos/etcd/etcdserver/api/v3election github.com/coreos/etcd/etcdserver/api/v3election/v3electionpb github.com/coreos/etcd/etcdserver/api/v3election/v3electionpb/gw github.com/coreos/etcd/etcdserver/api/v3lock github.com/coreos/etcd/etcdserver/api/v3lock/v3lockpb github.com/coreos/etcd/etcdserver/api/v3lock/v3lockpb/gw github.com/coreos/etcd/etcdserver/api/v3rpc github.com/coreos/etcd/etcdserver/api/v3rpc/rpctypes github.com/coreos/etcd/etcdserver/auth github.com/coreos/etcd/etcdserver/etcdserverpb github.com/coreos/etcd/etcdserver/etcdserverpb/gw github.com/coreos/etcd/etcdserver/membership github.com/coreos/etcd/etcdserver/stats github.com/coreos/etcd/functional/agent github.com/coreos/etcd/functional/cmd/etcd-agent github.com/coreos/etcd/functional/cmd/etcd-proxy github.com/coreos/etcd/functional/cmd/etcd-runner github.com/coreos/etcd/functional/cmd/etcd-tester github.com/coreos/etcd/functional/rpcpb github.com/coreos/etcd/functional/runner github.com/coreos/etcd/functional/tester github.com/coreos/etcd/integration github.com/coreos/etcd/lease github.com/coreos/etcd/lease/leasehttp github.com/coreos/etcd/lease/leasepb github.com/coreos/etcd/mvcc github.com/coreos/etcd/mvcc/backend github.com/coreos/etcd/mvcc/mvccpb github.com/coreos/etcd/pkg/adt github.com/coreos/etcd/pkg/contention github.com/coreos/etcd/pkg/cors github.com/coreos/etcd/pkg/cpuutil github.com/coreos/etcd/pkg/crc github.com/coreos/etcd/pkg/debugutil github.com/coreos/etcd/pkg/expect github.com/coreos/etcd/pkg/fileutil github.com/coreos/etcd/pkg/flags github.com/coreos/etcd/pkg/httputil github.com/coreos/etcd/pkg/idutil github.com/coreos/etcd/pkg/ioutil github.com/coreos/etcd/pkg/logutil github.com/coreos/etcd/pkg/mock/mockstorage github.com/coreos/etcd/pkg/mock/mockstore github.com/coreos/etcd/pkg/mock/mockwait github.com/coreos/etcd/pkg/monotime github.com/coreos/etcd/pkg/netutil github.com/coreos/etcd/pkg/osutil github.com/coreos/etcd/pkg/pathutil github.com/coreos/etcd/pkg/pbutil github.com/coreos/etcd/pkg/proxy github.com/coreos/etcd/pkg/report github.com/coreos/etcd/pkg/runtime github.com/coreos/etcd/pkg/schedule github.com/coreos/etcd/pkg/srv github.com/coreos/etcd/pkg/stringutil github.com/coreos/etcd/pkg/testutil github.com/coreos/etcd/pkg/tlsutil github.com/coreos/etcd/pkg/transport github.com/coreos/etcd/pkg/types github.com/coreos/etcd/pkg/wait github.com/coreos/etcd/proxy/grpcproxy github.com/coreos/etcd/proxy/grpcproxy/adapter github.com/coreos/etcd/proxy/grpcproxy/cache github.com/coreos/etcd/proxy/httpproxy github.com/coreos/etcd/proxy/tcpproxy github.com/coreos/etcd/raft github.com/coreos/etcd/raft/raftpb github.com/coreos/etcd/raft/rafttest github.com/coreos/etcd/rafthttp github.com/coreos/etcd/snap github.com/coreos/etcd/snap/snappb github.com/coreos/etcd/snapshot github.com/coreos/etcd/store github.com/coreos/etcd/version github.com/coreos/etcd/wal github.com/coreos/etcd/wal/walpb returned exit code 2
make: *** [debian/rules:13: build-arch] Error 255

Tail of log for libcereal on armhf:

/usr/bin/c++  -Werror -Wall -g -Wextra -Wshadow -pedantic -Wold-style-cast -g -O2 -fdebug-prefix-map=/<<PKGBUILDDIR>>=. -fstack-protector-strong -Wformat -Werror=format-security -Wdate-time -D_FORTIFY_SOURCE=2  -Wl,-z,relro CMakeFiles/test_unordered_set.dir/unordered_set.cpp.o  -o test_unordered_set 
make[4]: Leaving directory '/<<PKGBUILDDIR>>/obj-arm-linux-gnueabihf'
[ 52%] Built target test_unordered_set
[ 54%] Linking CXX executable test_load_construct
cd /<<PKGBUILDDIR>>/obj-arm-linux-gnueabihf/unittests && /usr/bin/cmake -E cmake_link_script CMakeFiles/test_load_construct.dir/link.txt --verbose=1
/usr/bin/c++  -Werror -Wall -g -Wextra -Wshadow -pedantic -Wold-style-cast -g -O2 -fdebug-prefix-map=/<<PKGBUILDDIR>>=. -fstack-protector-strong -Wformat -Werror=format-security -Wdate-time -D_FORTIFY_SOURCE=2  -Wl,-z,relro CMakeFiles/test_load_construct.dir/load_construct.cpp.o  -o test_load_construct 
make[4]: Leaving directory '/<<PKGBUILDDIR>>/obj-arm-linux-gnueabihf'
[ 54%] Built target test_load_construct
make[3]: Leaving directory '/<<PKGBUILDDIR>>/obj-arm-linux-gnueabihf'
make[2]: *** [Makefile:144: all] Error 2
make[2]: Leaving directory '/<<PKGBUILDDIR>>/obj-arm-linux-gnueabihf'
dh_auto_build: cd obj-arm-linux-gnueabihf && make -j4 "INSTALL=install --strip-program=true" all doc returned exit code 2
make[1]: *** [debian/rules:14: override_dh_auto_build] Error 255
make[1]: Leaving directory '/<<PKGBUILDDIR>>'
make: *** [debian/rules:8: build-arch] Error 2

Tail of log for pbbam on armhf:

-  m140905_042212_sidney_c100564852550000001823085912221377_s1_X0/19915/0_382\tlambda_NEB3011\t4843 (esc)
-  m140905_042212_sidney_c100564852550000001823085912221377_s1_X0/19915/0_382\tlambda_NEB3011\t4843 (esc)
-  m140905_042212_sidney_c100564852550000001823085912221377_s1_X0/7247/7338_7831\tlambda_NEB3011\t4904 (esc)
 
   $ [ -f $MERGED_BAM_PBI ] && echo "Found" || echo "Not found"
   Found
tests/src/cram/pbindexdump_json.deb.t: passed
tests/src/cram/pbindexdump_cpp.deb.t: passed
tests/src/cram/pbmerge_fofn.deb.t: passed
tests/src/cram/pbbamify.deb.t: passed
tests/src/cram/pbmerge_dataset.deb.t: passed
# Ran 8 tests, 0 skipped, 1 failed.
make[1]: *** [debian/rules:22: override_dh_auto_test] Error 1
make[1]: Leaving directory '/<<BUILDDIR>>/pbbam-0.23.0+dfsg'
make: *** [debian/rules:13: build-arch] Error 2

Tail of log for iannix on armhf:

  253 |         glColor4f(color.redF(), color.greenF(), color.blueF(), color.alphaF());
      |         ^~~~~~~~~
      |         qglColor
iannix.cpp: In member function 'virtual QString IanniX::incomingMessage(const MessageIncomming&, bool, bool)':
iannix.cpp:1215:45: warning: enum constant in boolean context [-Wint-in-bool-context]
 1215 |         execute(source, ExecuteSourceNetwork);
      |                                             ^
make[2]: *** [Makefile:2636: iannixapp.o] Error 1
make[2]: *** Waiting for unfinished jobs....
make[2]: *** [Makefile:2552: iannix.o] Error 1
make[2]: Leaving directory '/<<PKGBUILDDIR>>'
dh_auto_build: make -j4 returned exit code 2
make[1]: *** [debian/rules:32: override_dh_auto_build] Error 255
make[1]: Leaving directory '/<<PKGBUILDDIR>>'
make: *** [debian/rules:28: build-arch] Error 2

Tail of log for p4est on armhf:

# ERROR: 0
============================================================================
See ./test-suite.log
Please report to info@p4est.org
============================================================================
make[4]: *** [Makefile:3867: test-suite.log] Error 1
make[4]: Leaving directory '/<<PKGBUILDDIR>>'
make[3]: *** [Makefile:3975: check-TESTS] Error 2
make[3]: Leaving directory '/<<PKGBUILDDIR>>'
make[2]: *** [Makefile:4609: check-am] Error 2
make[2]: Leaving directory '/<<PKGBUILDDIR>>'
make[1]: *** [Makefile:3752: check-recursive] Error 1
make[1]: Leaving directory '/<<PKGBUILDDIR>>'
dh_auto_test: make -j4 check VERBOSE=1 returned exit code 2
make: *** [debian/rules:9: binary-arch] Error 255

Tail of log for libcec on armhf:

  _ZTVN10P8PLATFORM12SyncedBufferIN3CEC11cec_commandEEE@Base 3.1.0
  _ZTVN10P8PLATFORM12SyncedBufferIPN3CEC13CCallbackWrapEEE@Base 3.1.0
@@ -1219,8 +1219,8 @@
  _ZTVN3CEC6CCECTVE@Base 2.1.4
  _ZTVN3CEC7CLibCECE@Base 2.1.4
  _ZTVN3CEC9CCECTunerE@Base 2.1.4
- (arch=armel riscv64)_ZTVSt15_Sp_counted_ptrIPN3CEC10CCECClientELN9__gnu_cxx12_Lock_policyE1EE@Base 4.0.2+dfsg1-3~
- (arch=!armel !riscv64)_ZTVSt15_Sp_counted_ptrIPN3CEC10CCECClientELN9__gnu_cxx12_Lock_policyE2EE@Base 3.1.0
+ _ZTVSt15_Sp_counted_ptrIPN3CEC10CCECClientELN9__gnu_cxx12_Lock_policyE1EE@Base 4.0.2+dfsg1-3~
+#MISSING: 4.0.4+dfsg1-4# (arch=!armel !riscv64)_ZTVSt15_Sp_counted_ptrIPN3CEC10CCECClientELN9__gnu_cxx12_Lock_policyE2EE@Base 3.1.0
  _ZZN10P8PLATFORM26GetDetachedThreadAttributeEvE12g_threadAttr@Base 3.1.0
  _ZZN10P8PLATFORM26GetDetachedThreadAttributeEvE21bAttributeInitialised@Base 3.1.0
  _ZZN10P8PLATFORM26GetRecursiveMutexAttributeEvE11g_mutexAttr@Base 3.1.0
dh_makeshlibs: failing due to earlier errors
make: *** [debian/rules:8: binary-arch] Error 255

Tail of log for r-cran-httpuv on armhf:

g++ -std=gnu++11 -shared -L/usr/lib/R/lib -Wl,-z,relro -o httpuv.so RcppExports-legacy.o RcppExports.o callback.o callbackqueue.o filedatasource-unix.o filedatasource-win.o http.o httprequest.o httpresponse.o httpuv.o md5.o set_invalid_parameter.o socket.o thread.o utils.o uvutil.o webapplication.o websockets-base.o websockets-hixie76.o websockets-hybi03.o websockets-ietf.o websockets.o ./http-parser/http_parser.o ./sha1/sha1.o ./base64/base64.o -luv -L/usr/lib/R/lib -lR
make[1]: Leaving directory '/<<BUILDDIR>>/r-cran-httpuv-1.4.5.1+dfsg/src'
make[1]: Entering directory '/<<BUILDDIR>>/r-cran-httpuv-1.4.5.1+dfsg/src'
make[1]: Leaving directory '/<<BUILDDIR>>/r-cran-httpuv-1.4.5.1+dfsg/src'
installing to /<<BUILDDIR>>/r-cran-httpuv-1.4.5.1+dfsg/debian/r-cran-httpuv/usr/lib/R/site-library/00LOCK-r-cran-httpuv-1.4.5.1+dfsg/00new/httpuv/libs
** R
** demo
** byte-compile and prepare package for lazy loading
terminate called after throwing an instance of 'std::runtime_error'
  what():  Mutex creation failed
Aborted (core dumped)
ERROR: lazy loading failed for package 'httpuv'
* removing '/<<BUILDDIR>>/r-cran-httpuv-1.4.5.1+dfsg/debian/r-cran-httpuv/usr/lib/R/site-library/httpuv'
dh_auto_install: R CMD INSTALL -l /<<BUILDDIR>>/r-cran-httpuv-1.4.5.1\+dfsg/debian/r-cran-httpuv/usr/lib/R/site-library --clean . "--built-timestamp='Mon, 07 Jan 2019 11:46:10 +0100'" returned exit code 1
make: *** [debian/rules:4: binary-arch] Error 255

Tail of log for specutils on armhf:

.pybuild/cpython3_3.7/build/specutils/tests/test_resample.py::test_expanded_grid_fluxconserving
  /usr/lib/python3/dist-packages/astropy/units/quantity.py:464: RuntimeWarning: invalid value encountered in true_divide
    result = super().__array_ufunc__(function, method, *arrays, **kwargs)

.pybuild/cpython3_3.7/build/specutils/tests/test_spectrum_collection.py::test_create_spectrum_collection
  /usr/lib/python3/dist-packages/astropy/units/equivalencies.py:124: RuntimeWarning: divide by zero encountered in true_divide
    (si.m, si.Hz, lambda x: _si.c.value / x),
  /usr/lib/python3/dist-packages/astropy/units/equivalencies.py:125: RuntimeWarning: divide by zero encountered in true_divide
    (si.m, si.J, lambda x: hc / x),

-- Docs: https://docs.pytest.org/en/latest/warnings.html
== 3 failed, 162 passed, 18 skipped, 2 xfailed, 11 warnings in 34.38 seconds ===
E: pybuild pybuild:341: test: plugin distutils failed with: exit code=1: cd /<<PKGBUILDDIR>>/.pybuild/cpython3_3.7/build; python3.7 -m pytest --remote-data=none --doctest-rst
dh_auto_test: pybuild --test --test-pytest -i python{version} -p 3.7 returned exit code 13
make: *** [debian/rules:11: build-arch] Error 255

Tail of log for icinga2 on armhf:

      |   ^
/<<PKGBUILDDIR>>/lib/icinga/timeperiod.cpp: In member function 'void icinga::TimePeriod::RemoveSegment(double, double)':
/<<PKGBUILDDIR>>/lib/icinga/timeperiod.cpp:142:5: note: parameter passing for argument of type 'std::initializer_list<std::pair<const icinga::String, icinga::Value> >' changed in GCC 7.1
  142 |    }));
      |     ^
/<<PKGBUILDDIR>>/lib/icinga/timeperiod.cpp:147:5: note: parameter passing for argument of type 'std::initializer_list<std::pair<const icinga::String, icinga::Value> >' changed in GCC 7.1
  147 |    }));
      |     ^
make[3]: Leaving directory '/<<PKGBUILDDIR>>/obj-arm-linux-gnueabihf'
[ 66%] Built target icinga
make[2]: Leaving directory '/<<PKGBUILDDIR>>/obj-arm-linux-gnueabihf'
make[1]: *** [Makefile:166: all] Error 2
make[1]: Leaving directory '/<<PKGBUILDDIR>>/obj-arm-linux-gnueabihf'
dh_auto_build: cd obj-arm-linux-gnueabihf && make -j4 returned exit code 2
make: *** [debian/rules:18: build-arch] Error 255

Tail of log for cmus on armhf:

   gcc -shared -Wl,-z,relro -Wl,-z,now -Wl,--as-needed  -o op/roar.so op/roar.lo -lroar
   gcc  -o Doc/ttman Doc/ttman.o 
   Doc/ttman Doc/cmus.txt Doc/cmus.1
   Doc/ttman Doc/cmus-remote.txt Doc/cmus-remote.1
   Doc/ttman Doc/cmus-tutorial.txt Doc/cmus-tutorial.7
   gcc -Wl,-z,relro -Wl,-z,now -Wl,--as-needed  -o cmus ape.o browser.o buffer.o cache.o channelmap.o cmdline.o cmus.o command_mode.o comment.o convert.lo cue.o cue_utils.o debug.o discid.o editable.o expr.o filters.o format_print.o gbuf.o glob.o help.o history.o http.o id3.o input.o job.o keys.o keyval.o lib.o load_dir.o locking.o mergesort.o misc.o options.o output.o pcm.o player.o play_queue.o pl.o rbtree.o read_wrapper.o search_mode.o search.o server.o spawn.o tabexp_file.o tabexp.o track_info.o track.o tree.o uchar.o u_collate.o ui_curses.o window.o worker.o xstrjoin.o file.o path.o prog.o xmalloc.o -lpthread -lncursesw -ltinfo  -ldl -Wl,--export-dynamic -ldiscid -lm   
/usr/bin/ld: track_info.o: in function `track_info_new':
./track_info.c:47: undefined reference to `__atomic_fetch_add_8'
collect2: error: ld returned 1 exit status
make[2]: *** [Makefile:52: cmus] Error 1
make[2]: Leaving directory '/<<PKGBUILDDIR>>'
dh_auto_build: make -j4 V=2 returned exit code 2
make[1]: *** [debian/rules:41: override_dh_auto_build] Error 255
make[1]: Leaving directory '/<<PKGBUILDDIR>>'
make: *** [debian/rules:30: build-arch] Error 2

Tail of log for geary on armhf:

# End of ConversationPageStateTest tests
# End of js tests
-------


Ok:                    4
Expected Fail:         0
Fail:                  0
Unexpected Pass:       0
Skipped:               0
Timeout:               1
dh_auto_test: cd obj-arm-linux-gnueabihf && LC_ALL=C.UTF-8 MESON_TESTTHREADS=4 ninja test returned exit code 1
make[1]: *** [debian/rules:17: override_dh_auto_test] Error 255
make[1]: Leaving directory '/<<PKGBUILDDIR>>'
make: *** [debian/rules:11: build-arch] Error 2

Tail of log for r-cran-promises on armhf:

g++ -std=gnu++11 -shared -L/usr/lib/R/lib -Wl,-z,relro -o promises.so RcppExports.o promise_task.o -L/usr/lib/R/lib -lR
make[1]: Leaving directory '/<<PKGBUILDDIR>>/src'
make[1]: Entering directory '/<<PKGBUILDDIR>>/src'
make[1]: Leaving directory '/<<PKGBUILDDIR>>/src'
installing to /<<PKGBUILDDIR>>/debian/r-cran-promises/usr/lib/R/site-library/00LOCK-r-cran-promises-1.1.0/00new/promises/libs
** R
** inst
** byte-compile and prepare package for lazy loading
terminate called after throwing an instance of 'std::runtime_error'
  what():  Mutex creation failed
Aborted
ERROR: lazy loading failed for package 'promises'
* removing '/<<PKGBUILDDIR>>/debian/r-cran-promises/usr/lib/R/site-library/promises'
dh_auto_install: R CMD INSTALL -l /<<PKGBUILDDIR>>/debian/r-cran-promises/usr/lib/R/site-library --clean . "--built-timestamp='Mon, 07 Oct 2019 13:16:49 +0200'" returned exit code 1
make: *** [debian/rules:4: binary-arch] Error 255

Tail of log for r-cran-samr on armhf:

gcc -std=gnu99 -shared -L/usr/lib/R/lib -Wl,-z,relro -o samr.so rankcol.o samr_init.o -lgfortran -lm -L/usr/lib/R/lib -lR
make[1]: Leaving directory '/<<PKGBUILDDIR>>/src'
make[1]: Entering directory '/<<PKGBUILDDIR>>/src'
make[1]: Leaving directory '/<<PKGBUILDDIR>>/src'
installing to /<<PKGBUILDDIR>>/debian/r-cran-samr/usr/lib/R/site-library/00LOCK-r-cran-samr-3.0/00new/samr/libs
** R
** inst
** byte-compile and prepare package for lazy loading
terminate called after throwing an instance of 'std::runtime_error'
  what():  Mutex creation failed
Aborted (core dumped)
ERROR: lazy loading failed for package 'samr'
* removing '/<<PKGBUILDDIR>>/debian/r-cran-samr/usr/lib/R/site-library/samr'
dh_auto_install: R CMD INSTALL -l /<<PKGBUILDDIR>>/debian/r-cran-samr/usr/lib/R/site-library --clean . "--built-timestamp='Tue, 18 Dec 2018 08:16:30 +0100'" returned exit code 1
make: *** [debian/rules:4: binary-arch] Error 255

Tail of log for ruby-debian on armhf:

Finished in 2.257255569 seconds.
-------------------------------------------------------------------------------
69 tests, 181 assertions, 0 failures, 1 errors, 0 pendings, 0 omissions, 0 notifications
98.5507% passed
-------------------------------------------------------------------------------
30.57 tests/s, 80.19 assertions/s
rake aborted!
Command failed with status (1): [ruby -w  "/usr/lib/ruby/vendor_ruby/rake/rake_test_loader.rb" "t/testar.rb" "t/testarchives.rb" "t/testdeb.rb" "t/testdep.rb" "t/testdsc.rb" "t/teststatus.rb" -v]

Tasks: TOP => default
(See full trace by running task with --trace)
ERROR: Test "ruby2.5" failed. Exiting.
dh_auto_install: dh_ruby --install /<<PKGBUILDDIR>>/debian/ruby-debian returned exit code 1
make: *** [debian/rules:6: binary-arch] Error 255

Tail of log for rust-sysinfo on armhf:

error[E0658]: use of unstable library feature 'maybe_uninit' (see issue #53491)
  --> src/utils.rs:39:32
   |
39 |         let buf = unsafe { buf.assume_init() };
   |                                ^^^^^^^^^^^

error: aborting due to 4 previous errors

For more information about this error, try `rustc --explain E0658`.
error: Could not compile `sysinfo`.

Caused by:
  process didn't exit successfully: `CARGO_PKG_AUTHORS='Guillaume Gomez <guillaume1.gomez@gmail.com>' OUT_DIR=/<<PKGBUILDDIR>>/target/arm-unknown-linux-gnueabihf/debug/build/sysinfo-bcb6fc7287a22309/out CARGO_MANIFEST_DIR=/<<PKGBUILDDIR>> CARGO_PKG_DESCRIPTION='Library to handle processes' CARGO_PKG_VERSION_MINOR=9 CARGO_PKG_VERSION_MAJOR=0 CARGO_PKG_VERSION=0.9.5 CARGO=/usr/bin/cargo LD_LIBRARY_PATH='/<<PKGBUILDDIR>>/target/debug/deps:/usr/lib' CARGO_PKG_VERSION_PATCH=5 CARGO_PKG_HOMEPAGE= CARGO_PKG_NAME=sysinfo CARGO_PKG_REPOSITORY='https://github.com/GuillaumeGomez/sysinfo' CARGO_PKG_VERSION_PRE= CARGO_PRIMARY_PACKAGE=1 rustc --crate-name sysinfo src/sysinfo.rs --color never --crate-type rlib --crate-type cdylib --emit=dep-info,link -C debuginfo=2 -C metadata=0a5915de21ae6f11 --out-dir /<<PKGBUILDDIR>>/target/arm-unknown-linux-gnueabihf/debug/deps --target arm-unknown-linux-gnueabihf -C incremental=/<<PKGBUILDDIR>>/target/arm-unknown-linux-gnueabihf/debug/incremental -L dependency=/<<PKGBUILDDIR>>/target/arm-unknown-linux-gnueabihf/debug/deps -L dependency=/<<PKGBUILDDIR>>/target/debug/deps --extern cfg_if=/<<PKGBUILDDIR>>/target/arm-unknown-linux-gnueabihf/debug/deps/libcfg_if-427502b868d157b2.rlib --extern doc_comment=/<<PKGBUILDDIR>>/target/arm-unknown-linux-gnueabihf/debug/deps/libdoc_comment-caf2735280b2a5ef.rlib --extern libc=/<<PKGBUILDDIR>>/target/arm-unknown-linux-gnueabihf/debug/deps/liblibc-026cc680808d4980.rlib --extern rayon=/<<PKGBUILDDIR>>/target/arm-unknown-linux-gnueabihf/debug/deps/librayon-9c254934e716e96f.rlib -C debuginfo=2 --cap-lints warn -C linker=arm-linux-gnueabihf-gcc -C link-arg=-Wl,-z,relro --remap-path-prefix /<<PKGBUILDDIR>>=/usr/share/cargo/registry/sysinfo-0.9.5` (exit code: 1)
dh_auto_test: /usr/share/cargo/bin/cargo build returned exit code 101
make: *** [debian/rules:3: build-arch] Error 255

Tail of log for tiledarray on armhf:

    #include <Eigen/Core>
    #include <Eigen/Dense>
    #include <iostream>
    int main(int argc, char* argv[]){
      Eigen::MatrixXd m = Eigen::MatrixXd::Random(5, 5);
      m = m.transpose() + m;
      Eigen::SelfAdjointEigenSolver<Eigen::MatrixXd> eig(m);
      Eigen::MatrixXd m_invsqrt = eig.operatorInverseSqrt();
      std::cout << m_invsqrt << std::endl;
    }
dh_auto_configure: cd obj-arm-linux-gnueabihf && cmake -DCMAKE_INSTALL_PREFIX=/usr -DCMAKE_BUILD_TYPE=None -DCMAKE_INSTALL_SYSCONFDIR=/etc -DCMAKE_INSTALL_LOCALSTATEDIR=/var -DCMAKE_EXPORT_NO_PACKAGE_REGISTRY=ON -DCMAKE_FIND_PACKAGE_NO_PACKAGE_REGISTRY=ON "-GUnix Makefiles" -DCMAKE_VERBOSE_MAKEFILE=ON -DCMAKE_INSTALL_LIBDIR=lib/arm-linux-gnueabihf -DCMAKE_BUILD_TYPE=none -DTA_BUILD_UNITTEST=ON -DTA_ERROR=throw -DENABLE_SHARED_LIBRARIES=OFF "-DCMAKE_CXX_FLAGS=-g -O2 -fdebug-prefix-map=/<<PKGBUILDDIR>>=. -fstack-protector-strong -Wformat -Werror=format-security -I/usr/include/arm-linux-gnueabihf/mpich -g1" "-DCMAKE_EXE_LINKER_FLAGS=-lmpich -lm -lbacktrace -lpthread -lrt" .. returned exit code 1
make[1]: *** [debian/rules:43: override_dh_auto_configure] Error 2
make[1]: Leaving directory '/<<PKGBUILDDIR>>'
make: *** [debian/rules:40: build-arch] Error 2

Tail of log for socat on armhf:

test 365 UNIX_LISTEN_REMOVE_FORK: UNIX-LISTEN with fork removes socket entry when terminated during accept... OK
test 374 OPENSSL_METHOD_DTLS1: test OpenSSL method DTLS1... Option openssl-method not available
test 375 FDOUT_ERROR: fdout bails out in write-only context... OK
test 376 SYSTEM_RC: promote failure of SYSTEM... OK
test 377 EXEC_RC: promote failure of EXEC... OK
test 378 SO_REUSEADDR: test the so-reuseaddr option... OK
test 379 SO_REUSEPORT: test the so-reuseport option... OK
test 382 USE_IPV6_JOIN_GROUP: is option ipv6-join-group used... OK
test 383 DIAG_FDIN: test use of fdin=3... OK
summary: 385 tests, 353 selected; 264 ok, 13 failed, 76 could not be performed
FAILED:  61 62 63 72 73 74 75 76 77 79 215 306 307
make[1]: *** [Makefile:187: test] Error 1
make[1]: Leaving directory '/<<PKGBUILDDIR>>'
dh_auto_test: make -j4 test VERBOSE=1 returned exit code 2
make: *** [debian/rules:15: build-arch] Error 255

Tail of log for glib-d on armhf:

/usr/bin/ld: glibd-2.0@sha/obj-arm-linux-gnueabihf_generated_gobject_TypeModule.d.o: in function `_DT20_D7gobject10TypeModule10TypeModule5unuseMFZv':
./obj-arm-linux-gnueabihf/../obj-arm-linux-gnueabihf/generated/gobject/TypeModule.d:242: multiple definition of `_DT20_D7gobject10TypeModule10TypeModule5unuseMFZv'; glibd-2.0@sha/obj-arm-linux-gnueabihf_generated_gio_IOModule.d.o:./obj-arm-linux-gnueabihf/../obj-arm-linux-gnueabihf/generated/gio/IOModule.d:55: first defined here
/usr/bin/ld: glibd-2.0@sha/obj-arm-linux-gnueabihf_generated_gobject_TypeModule.d.o: in function `_DT20_D7gobject10TypeModule10TypeModule9__mixin1319getTypePluginStructMFbZPS7gobject1c5types11GTypePlugin':
./obj-arm-linux-gnueabihf/../obj-arm-linux-gnueabihf/generated/gobject/TypeModule.d:242: multiple definition of `_DT20_D7gobject10TypeModule10TypeModule9__mixin1319getTypePluginStructMFbZPS7gobject1c5types11GTypePlugin'; glibd-2.0@sha/obj-arm-linux-gnueabihf_generated_gio_IOModule.d.o:./obj-arm-linux-gnueabihf/../obj-arm-linux-gnueabihf/generated/gio/IOModule.d:55: first defined here
/usr/bin/ld: glibd-2.0@sha/obj-arm-linux-gnueabihf_generated_gobject_TypeModule.d.o: in function `_DT20_D7gobject10TypeModule10TypeModule9__mixin133useMFZv':
./obj-arm-linux-gnueabihf/../obj-arm-linux-gnueabihf/generated/gobject/TypeModule.d:242: multiple definition of `_DT20_D7gobject10TypeModule10TypeModule9__mixin133useMFZv'; glibd-2.0@sha/obj-arm-linux-gnueabihf_generated_gio_IOModule.d.o:./obj-arm-linux-gnueabihf/../obj-arm-linux-gnueabihf/generated/gio/IOModule.d:55: first defined here
/usr/bin/ld: glibd-2.0@sha/obj-arm-linux-gnueabihf_generated_gobject_TypeModule.d.o: in function `_DT20_D7gobject10TypeModule10TypeModule9__mixin1321completeInterfaceInfoMFE7gobject1c5types5GTypeE7gobject1c5types5GTypePS7gobject1c5types14GInterfaceInfoZv':
./obj-arm-linux-gnueabihf/../obj-arm-linux-gnueabihf/generated/gobject/TypeModule.d:242: multiple definition of `_DT20_D7gobject10TypeModule10TypeModule9__mixin1321completeInterfaceInfoMFE7gobject1c5types5GTypeE7gobject1c5types5GTypePS7gobject1c5types14GInterfaceInfoZv'; glibd-2.0@sha/obj-arm-linux-gnueabihf_generated_gio_IOModule.d.o:./obj-arm-linux-gnueabihf/../obj-arm-linux-gnueabihf/generated/gio/IOModule.d:55: first defined here
/usr/bin/ld: glibd-2.0@sha/obj-arm-linux-gnueabihf_generated_gobject_TypeModule.d.o: in function `_DT20_D7gobject10TypeModule10TypeModule9__mixin1316completeTypeInfoMFE7gobject1c5types5GTypePS7gobject1c5types9GTypeInfoPS7gobject1c5types15GTypeValueTableZv':
./obj-arm-linux-gnueabihf/../obj-arm-linux-gnueabihf/generated/gobject/TypeModule.d:242: multiple definition of `_DT20_D7gobject10TypeModule10TypeModule9__mixin1316completeTypeInfoMFE7gobject1c5types5GTypePS7gobject1c5types9GTypeInfoPS7gobject1c5types15GTypeValueTableZv'; glibd-2.0@sha/obj-arm-linux-gnueabihf_generated_gio_IOModule.d.o:./obj-arm-linux-gnueabihf/../obj-arm-linux-gnueabihf/generated/gio/IOModule.d:55: first defined here
collect2: error: ld returned 1 exit status
[330/334] gdc -Itests/gobject/60338e1@@dclosure_test@exe -Itests/gobject -I../tests/gobject -Igenerated -I../generated -I/usr/include/glib-2.0 -I/usr/lib/arm-linux-gnueabihf/glib-2.0/include -I/usr/include/libmount -I/usr/include/blkid -g -O2 -fdebug-prefix-map=/<<PKGBUILDDIR>>=. -fstack-protector-strong -frelease -pthread -MD -MQ 'tests/gobject/60338e1@@dclosure_test@exe/DClosureTest.d.o' -MF 'tests/gobject/60338e1@@dclosure_test@exe/DClosureTest.d.o.deps' -o 'tests/gobject/60338e1@@dclosure_test@exe/DClosureTest.d.o' -c ../tests/gobject/DClosureTest.d
ninja: build stopped: subcommand failed.
dh_auto_build: cd obj-arm-linux-gnueabihf && LC_ALL=C.UTF-8 ninja -j4 -v returned exit code 1
make: *** [debian/rules:8: build-arch] Error 255

Tail of log for bagel on armhf:

mpi_interface.cc:267:32: error: static assertion failed: size_t is assumed to be the same size as unsigned long long
  267 |   static_assert(sizeof(size_t) == sizeof(unsigned long long), "size_t is assumed to be the same size as unsigned long long");
      |                 ~~~~~~~~~~~~~~~^~~~~~~~~~~~~~~~~~~~~~~~~~~~~
make[5]: *** [Makefile:408: mpi_interface.lo] Error 1
make[5]: Leaving directory '/<<PKGBUILDDIR>>/src/util/parallel'
make[4]: *** [Makefile:462: all-recursive] Error 1
make[4]: Leaving directory '/<<PKGBUILDDIR>>/src/util'
make[3]: *** [Makefile:625: all-recursive] Error 1
make[3]: Leaving directory '/<<PKGBUILDDIR>>/src'
make[2]: *** [Makefile:422: all-recursive] Error 1
make[2]: Leaving directory '/<<PKGBUILDDIR>>'
make[1]: *** [Makefile:354: all] Error 2
make[1]: Leaving directory '/<<PKGBUILDDIR>>'
dh_auto_build: make -j1 returned exit code 2
make: *** [debian/rules:12: build-arch] Error 255

Dependency installability problem for statsmodels on armhf:

statsmodels build-depends on missing:
- python-cvxopt:armhf

Tail of log for haskell-cryptol on armhf:

. /usr/share/haskell-devscripts/Dh_Haskell.sh && \
build_recipe
Running debian/hlibrary.setup build --builddir=dist-ghc
Preprocessing library for cryptol-2.6.0..
Building library for cryptol-2.6.0..

src/Cryptol/Eval/Arch.hs:25:2: error:
     error: #error unknown max width for gmp on this architecture
       25 | #error unknown max width for gmp on this architecture
          |  ^~~~~
   |
25 | #error unknown max width for gmp on this architecture
   |  ^
`arm-linux-gnueabihf-gcc' failed in phase `C pre-processor'. (Exit code: 1)
make: *** [/usr/share/cdbs/1/class/hlibrary.mk:147: build-ghc-stamp] Error 1

Tail of log for haskell-protobuf on armhf:

    int64:                                       OK (0.01s)
      +++ OK, passed 100 tests (100% prop_wire :: Int64).
    word32:                                      OK
      +++ OK, passed 100 tests (100% prop_wire :: Word32).
    word64:                                      OK
      +++ OK, passed 100 tests (100% prop_wire :: Word64).
    sint32:                                      OK
      +++ OK, passed 100 tests (100% prop_wire :: Signed Int32).
    sint64:                                      OK (0.01s)
      +++ OK, passed 100 tests (100% prop_wire :: Signed Int64).
    fixed32:                                     protobuf-test: too many pending signals
Test suite protobuf-test: FAIL
Test suite logged to: dist-ghc/test/protobuf-0.2.1.2-protobuf-test.log
0 of 1 test suites (0 of 1 test cases) passed.
make: *** [/usr/share/cdbs/1/class/hlibrary.mk:154: check-ghc-stamp] Error 1

Tail of log for highwayhash on armhf:

./highwayhash/profiler.h: In member function 'void highwayhash::Results::UpdateOrAdd(size_t, uint64_t, uint64_t)':
./highwayhash/profiler.h:424:54: warning: left shift count >= width of type [-Wshift-count-overflow]
  424 |     zone->num_calls = (biased_offset << Accumulator::kNumCallBits) + num_calls;
      |                                                      ^~~~~~~~~~~~
./highwayhash/profiler.h: In member function 'void highwayhash::Results::MergeDuplicates()':
./highwayhash/profiler.h:458:42: warning: left shift count >= width of type [-Wshift-count-overflow]
  458 |           (biased_offset << Accumulator::kNumCallBits) + num_calls;
      |                                          ^~~~~~~~~~~~
make[1]: *** [Makefile:52: obj/profiler_example.o] Error 1
make[1]: *** Waiting for unfinished jobs....
make[1]: *** [Makefile:51: obj/nanobenchmark.o] Error 1
rm obj/nanobenchmark_example.o
make[1]: Leaving directory '/<<PKGBUILDDIR>>'
dh_auto_build: make -j4 "INSTALL=install --strip-program=true" returned exit code 2
make: *** [debian/rules:22: build-arch] Error 255

Tail of log for ismrmrd on armhf:

/<<PKGBUILDDIR>>/tests/test_acquisitions.cpp(7): Leaving test suite "AcquisitionsTest"; testing time: 23012us
Test is aborted
Leaving test module "ISMRMRD Unit Tests"; testing time: 23194us

*** 1 failure is detected in the test module "ISMRMRD Unit Tests"
make[4]: *** [tests/CMakeFiles/check.dir/build.make:60: tests/CMakeFiles/check] Error 201
make[4]: Leaving directory '/<<PKGBUILDDIR>>/obj-arm-linux-gnueabihf'
make[3]: *** [CMakeFiles/Makefile2:485: tests/CMakeFiles/check.dir/all] Error 2
make[3]: Leaving directory '/<<PKGBUILDDIR>>/obj-arm-linux-gnueabihf'
make[2]: *** [CMakeFiles/Makefile2:492: tests/CMakeFiles/check.dir/rule] Error 2
make[2]: Leaving directory '/<<PKGBUILDDIR>>/obj-arm-linux-gnueabihf'
make[1]: *** [Makefile:306: check] Error 2
make[1]: Leaving directory '/<<PKGBUILDDIR>>/obj-arm-linux-gnueabihf'
dh_auto_test: cd obj-arm-linux-gnueabihf && make -j4 check ARGS\+=-j4 returned exit code 2
make: *** [debian/rules:14: build-arch] Error 255

Tail of log for kvmtool on armhf:

    inlined from 'kvm_cmd_run_init' at builtin-run.c:510:30:
/usr/include/arm-linux-gnueabihf/bits/string_fortified.h:106:10: error: '__builtin_strncpy' specified bound 4096 equals destination size [-Werror=stringop-truncation]
  106 |   return __builtin___strncpy_chk (__dest, __src, __len, __bos (__dest));
      |          ^~~~~~~~~~~~~~~~~~~~~~~~~~~~~~~~~~~~~~~~~~~~~~~~~~~~~~~~~~~~~~
gcc -c -Wp,-MD,./.guest_compat.o.d  -march=armv7-a -DCONFIG_GUEST_INIT -Wdate-time -D_FORTIFY_SOURCE=2 -DCONFIG_ARM -D_FILE_OFFSET_BITS=64 -D_GNU_SOURCE -DKVMTOOLS_VERSION='""' -DBUILD_ARCH='"arm"' -Iinclude -Iarm/include -Iarm/aarch32/include -O2 -fno-strict-aliasing -g -Wall -Wformat=2 -Winit-self -Wmissing-declarations -Wmissing-prototypes -Wnested-externs -Wno-system-headers -Wold-style-definition -Wredundant-decls -Wsign-compare -Wstrict-prototypes -Wundef -Wvolatile-register-var -Wwrite-strings -Wno-format-nonliteral -Werror -DCONFIG_HAS_ZLIB -DCONFIG_HAS_AIO -DCONFIG_HAS_LIBFDT guest_compat.c -o guest_compat.o
gcc -c -Wp,-MD,hw/.rtc.o.d  -march=armv7-a -DCONFIG_GUEST_INIT -Wdate-time -D_FORTIFY_SOURCE=2 -DCONFIG_ARM -D_FILE_OFFSET_BITS=64 -D_GNU_SOURCE -DKVMTOOLS_VERSION='""' -DBUILD_ARCH='"arm"' -Iinclude -Iarm/include -Iarm/aarch32/include -O2 -fno-strict-aliasing -g -Wall -Wformat=2 -Winit-self -Wmissing-declarations -Wmissing-prototypes -Wnested-externs -Wno-system-headers -Wold-style-definition -Wredundant-decls -Wsign-compare -Wstrict-prototypes -Wundef -Wvolatile-register-var -Wwrite-strings -Wno-format-nonliteral -Werror -DCONFIG_HAS_ZLIB -DCONFIG_HAS_AIO -DCONFIG_HAS_LIBFDT hw/rtc.c -o hw/rtc.o
gcc -c -Wp,-MD,hw/.serial.o.d  -march=armv7-a -DCONFIG_GUEST_INIT -Wdate-time -D_FORTIFY_SOURCE=2 -DCONFIG_ARM -D_FILE_OFFSET_BITS=64 -D_GNU_SOURCE -DKVMTOOLS_VERSION='""' -DBUILD_ARCH='"arm"' -Iinclude -Iarm/include -Iarm/aarch32/include -O2 -fno-strict-aliasing -g -Wall -Wformat=2 -Winit-self -Wmissing-declarations -Wmissing-prototypes -Wnested-externs -Wno-system-headers -Wold-style-definition -Wredundant-decls -Wsign-compare -Wstrict-prototypes -Wundef -Wvolatile-register-var -Wwrite-strings -Wno-format-nonliteral -Werror -DCONFIG_HAS_ZLIB -DCONFIG_HAS_AIO -DCONFIG_HAS_LIBFDT hw/serial.c -o hw/serial.o
gcc -c -Wp,-MD,./.ioport.o.d  -march=armv7-a -DCONFIG_GUEST_INIT -Wdate-time -D_FORTIFY_SOURCE=2 -DCONFIG_ARM -D_FILE_OFFSET_BITS=64 -D_GNU_SOURCE -DKVMTOOLS_VERSION='""' -DBUILD_ARCH='"arm"' -Iinclude -Iarm/include -Iarm/aarch32/include -O2 -fno-strict-aliasing -g -Wall -Wformat=2 -Winit-self -Wmissing-declarations -Wmissing-prototypes -Wnested-externs -Wno-system-headers -Wold-style-definition -Wredundant-decls -Wsign-compare -Wstrict-prototypes -Wundef -Wvolatile-register-var -Wwrite-strings -Wno-format-nonliteral -Werror -DCONFIG_HAS_ZLIB -DCONFIG_HAS_AIO -DCONFIG_HAS_LIBFDT ioport.c -o ioport.o
gcc -c -Wp,-MD,./.irq.o.d  -march=armv7-a -DCONFIG_GUEST_INIT -Wdate-time -D_FORTIFY_SOURCE=2 -DCONFIG_ARM -D_FILE_OFFSET_BITS=64 -D_GNU_SOURCE -DKVMTOOLS_VERSION='""' -DBUILD_ARCH='"arm"' -Iinclude -Iarm/include -Iarm/aarch32/include -O2 -fno-strict-aliasing -g -Wall -Wformat=2 -Winit-self -Wmissing-declarations -Wmissing-prototypes -Wnested-externs -Wno-system-headers -Wold-style-definition -Wredundant-decls -Wsign-compare -Wstrict-prototypes -Wundef -Wvolatile-register-var -Wwrite-strings -Wno-format-nonliteral -Werror -DCONFIG_HAS_ZLIB -DCONFIG_HAS_AIO -DCONFIG_HAS_LIBFDT irq.c -o irq.o
cc1: all warnings being treated as errors
make[1]: *** [Makefile:435: builtin-run.o] Error 1
make[1]: *** Waiting for unfinished jobs....
make[1]: Leaving directory '/<<PKGBUILDDIR>>'
dh_auto_build: make -j4 returned exit code 2
make: *** [debian/rules:3: build-arch] Error 255

Tail of log for libundead on armhf:

/<<PKGBUILDDIR>>/src/undead/stream.d:1207:10: error: generic thunk code fails for method ‘_DT12_D6undead6stream6Stream6printfMFAxaYk’ which uses ‘...’
 1207 |   size_t printf(const(char)[] format, ...) {
      |          ^
/<<PKGBUILDDIR>>/src/undead/stream.d:1222:16: error: generic thunk code fails for method ‘_DT12_D6undead6stream6Stream6writefMFYC6undead6stream12OutputStream’ which uses ‘...’
 1222 |   OutputStream writef(...) {
      |                ^
/<<PKGBUILDDIR>>/src/undead/stream.d:1227:16: error: generic thunk code fails for method ‘_DT12_D6undead6stream6Stream8writeflnMFYC6undead6stream12OutputStream’ which uses ‘...’
 1227 |   OutputStream writefln(...) {
      |                ^
[3/29] gdc -Iundead@sha -I. -I.. -I../src/ -g -O2 -fdebug-prefix-map=/<<PKGBUILDDIR>>=. -fstack-protector-strong -frelease -fPIC -MD -MQ 'undead@sha/src_undead_bitarray.d.o' -MF 'undead@sha/src_undead_bitarray.d.o.deps' -o 'undead@sha/src_undead_bitarray.d.o' -c ../src/undead/bitarray.d
[4/29] gdc -Iundead@sha -I. -I.. -I../src/ -g -O2 -fdebug-prefix-map=/<<PKGBUILDDIR>>=. -fstack-protector-strong -frelease -fPIC -MD -MQ 'undead@sha/src_undead_date.d.o' -MF 'undead@sha/src_undead_date.d.o.deps' -o 'undead@sha/src_undead_date.d.o' -c ../src/undead/date.d
[5/29] gdc -Iundead@sha -I. -I.. -I../src/ -g -O2 -fdebug-prefix-map=/<<PKGBUILDDIR>>=. -fstack-protector-strong -frelease -fPIC -MD -MQ 'undead@sha/src_undead_dateparse.d.o' -MF 'undead@sha/src_undead_dateparse.d.o.deps' -o 'undead@sha/src_undead_dateparse.d.o' -c ../src/undead/dateparse.d
ninja: build stopped: subcommand failed.
dh_auto_build: cd obj-arm-linux-gnueabihf && LC_ALL=C.UTF-8 ninja -j4 -v returned exit code 1
make: *** [debian/rules:9: build-arch] Error 255

Tail of log for mrs on armhf:

/usr/bin/ld: obj/M6Progress.o: in function `std::__atomic_base<long long>::operator+=(long long)':
/usr/include/c++/9/bits/atomic_base.h:335: undefined reference to `__atomic_fetch_add_8'
/usr/bin/ld: obj/M6Progress.o: in function `std::__atomic_base<long long>::store(long long, std::memory_order)':
/usr/include/c++/9/bits/atomic_base.h:397: undefined reference to `__atomic_store_8'
/usr/bin/ld: /usr/include/c++/9/bits/atomic_base.h:397: undefined reference to `__atomic_store_8'
/usr/bin/ld: obj/M6Progress.o: in function `std::__atomic_base<long long>::load(std::memory_order) const':
/usr/include/c++/9/bits/atomic_base.h:419: undefined reference to `__atomic_load_8'
/usr/bin/ld: /usr/include/c++/9/bits/atomic_base.h:419: undefined reference to `__atomic_load_8'
/usr/bin/ld: /usr/include/c++/9/bits/atomic_base.h:419: undefined reference to `__atomic_load_8'
/usr/bin/ld: /usr/include/c++/9/bits/atomic_base.h:419: undefined reference to `__atomic_load_8'
collect2: error: ld returned 1 exit status
make[1]: *** [GNUmakefile:101: mrs] Error 1
make[1]: Leaving directory '/<<BUILDDIR>>/mrs-6.0.5+dfsg'
dh_auto_build: make -j4 returned exit code 2
make: *** [debian/rules:12: build-arch] Error 255

Tail of log for ngs-sdk on armhf:

   debian/rules override_dh_auto_build
make[1]: Entering directory '/<<PKGBUILDDIR>>'
#dh_auto_build --sourcedirectory=ngs-sdk
echo "DEBPKGNAME: EBPKGNAME"
DEBPKGNAME: EBPKGNAME
dh_auto_build --sourcedirectory=ngs-sdk
	cd ngs-sdk && make -j4
make[2]: Entering directory '/<<PKGBUILDDIR>>/ngs-sdk'
*** File 'Makefile.config.linux.armv8l' is missing. Please run ./configure
make[2]: *** [/<<PKGBUILDDIR>>/ngs-sdk/Makefile.rules:72: Makefile.config.linux.armv8l] Error 1
make[2]: Leaving directory '/<<PKGBUILDDIR>>/ngs-sdk'
dh_auto_build: cd ngs-sdk && make -j4 returned exit code 2
make[1]: *** [debian/rules:42: override_dh_auto_build] Error 255
make[1]: Leaving directory '/<<PKGBUILDDIR>>'
make: *** [debian/rules:18: build-arch] Error 2

Tail of log for gfccore on armhf:

set -e;    
make[1]: Leaving directory '/<<PKGBUILDDIR>>'
if [ "reverse-patches" = "reverse-patches" ]; then rm -f debian/stamp-patched; fi
patches: 
if [ "reverse-patches" != "reverse-patches" ]; then touch debian/stamp-patched; fi
if [ "reverse-patches" != "reverse-patches" ] ; then \
	/usr/bin/make -f debian/rules update-config ; \
fi
for dir in debian/patches ; do \
    rm -f $dir/*.log ; \
done
set -e;    
dh_clean 
dh_clean: Compatibility levels before 5 are no longer supported (level 4 requested)
make: *** [/usr/share/cdbs/1/rules/debhelper.mk:210: clean] Error 255

Tail of log for pocl on armhf:

- (arch=armel)_ZTVSt23_Sp_counted_ptr_inplaceIN5clang22PCHContainerOperationsESaIS1_ELN9__gnu_cxx12_Lock_policyE1EE@Base 0.12-5~llvm3.7
- (arch=!armel)_ZTVSt23_Sp_counted_ptr_inplaceIN5clang22PCHContainerOperationsESaIS1_ELN9__gnu_cxx12_Lock_policyE2EE@Base 0.12-5~llvm3.7
+ _ZTVSt23_Sp_counted_ptr_inplaceIN4llvm3sys2fs6detail12DirIterStateESaIS4_ELN9__gnu_cxx12_Lock_policyE1EE@Base 0.14-7~llvm4.0
+#MISSING: 1.3-9# (arch=!armel)_ZTVSt23_Sp_counted_ptr_inplaceIN4llvm3sys2fs6detail12DirIterStateESaIS4_ELN9__gnu_cxx12_Lock_policyE2EE@Base 0.14-7~llvm4.0
+ _ZTVSt23_Sp_counted_ptr_inplaceIN4llvm3sys2fs6detail15RecDirIterStateESaIS4_ELN9__gnu_cxx12_Lock_policyE1EE@Base 0.14-7~llvm4.0
+#MISSING: 1.3-9# (arch=!armel)_ZTVSt23_Sp_counted_ptr_inplaceIN4llvm3sys2fs6detail15RecDirIterStateESaIS4_ELN9__gnu_cxx12_Lock_policyE2EE@Base 0.14-7~llvm4.0
+ _ZTVSt23_Sp_counted_ptr_inplaceIN5clang22PCHContainerOperationsESaIS1_ELN9__gnu_cxx12_Lock_policyE1EE@Base 0.12-5~llvm3.7
+#MISSING: 1.3-9# (arch=!armel)_ZTVSt23_Sp_counted_ptr_inplaceIN5clang22PCHContainerOperationsESaIS1_ELN9__gnu_cxx12_Lock_policyE2EE@Base 0.12-5~llvm3.7
  _ZZNSt19_Sp_make_shared_tag5_S_tiEvE5__tag@Base 1.1-8~llvm6.0+gcc8.2
 #MISSING: 0.14# check_compiler_cache@Base 0.10
  clGetExtensionFunctionAddress@Base 0.10
dh_makeshlibs: failing due to earlier errors
make[1]: *** [debian/rules:105: run_dh_makeshlibs] Error 255
make[1]: Leaving directory '/<<PKGBUILDDIR>>'
make: *** [debian/rules:55: binary-arch] Error 2

Tail of log for reprozip on armhf:

running build_ext
building 'reprozip._pytracer' extension
creating build
creating build/temp.linux-armhf-3.7
creating build/temp.linux-armhf-3.7/native
arm-linux-gnueabihf-gcc -pthread -Wno-unused-result -Wsign-compare -DNDEBUG -g -fwrapv -O2 -Wall -g -fstack-protector-strong -Wformat -Werror=format-security -g -fwrapv -O2 -g -O2 -fdebug-prefix-map=/<<PKGBUILDDIR>>=. -fstack-protector-strong -Wformat -Werror=format-security -Wdate-time -D_FORTIFY_SOURCE=2 -fPIC -I/usr/include/python3.7m -c native/pytracer.c -o build/temp.linux-armhf-3.7/native/pytracer.o
In file included from native/tracer.h:4,
                 from native/pytracer.c:5:
native/config.h:12:9: error: #error Unrecognized architecture!
   12 | #       error Unrecognized architecture!
      |         ^~~~~
error: command 'arm-linux-gnueabihf-gcc' failed with exit status 1
E: pybuild pybuild:341: build: plugin distutils failed with: exit code=1: /usr/bin/python3 setup.py build 
dh_auto_build: pybuild --build -i python{version} -p 3.7 returned exit code 13
make: *** [debian/rules:13: build-arch] Error 255

Tail of log for libibcm on armhf:

#define HAVE_STRING_H 1
#define HAVE_MEMORY_H 1
#define HAVE_STRINGS_H 1
#define HAVE_INTTYPES_H 1
#define HAVE_STDINT_H 1
#define HAVE_UNISTD_H 1
#define HAVE_DLFCN_H 1
#define LT_OBJDIR ".libs/"
#define SIZEOF_LONG 4
#define HAVE_LIBIBVERBS 1
#define STDC_HEADERS 1

configure: exit 1
dh_auto_configure: ./configure --build=arm-linux-gnueabihf --prefix=/usr --includedir=\${prefix}/include --mandir=\${prefix}/share/man --infodir=\${prefix}/share/info --sysconfdir=/etc --localstatedir=/var --disable-silent-rules --libdir=\${prefix}/lib/arm-linux-gnueabihf --libexecdir=\${prefix}/lib/arm-linux-gnueabihf --disable-maintainer-mode --disable-dependency-tracking returned exit code 1
make: *** [debian/rules:7: build-arch] Error 255

Tail of log for libqglviewer on armhf:

compilation terminated.
In file included from domUtils.h:23,
                 from manipulatedFrame.cpp:23:
config.h:83:11: fatal error: GL/glu.h: No such file or directory
   83 | # include <GL/glu.h>
      |           ^~~~~~~~~~
compilation terminated.
make[1]: *** [Makefile:627: .obj/manipulatedCameraFrame.o] Error 1
make[1]: *** Waiting for unfinished jobs....
make[1]: *** [Makefile:599: .obj/camera.o] Error 1
make[1]: *** [Makefile:613: .obj/manipulatedFrame.o] Error 1
make[1]: *** [Makefile:585: .obj/qglviewer.o] Error 1
make[1]: Leaving directory '/<<BUILDDIR>>/libqglviewer-2.6.3+dfsg2/QGLViewer'
dh_auto_build: cd QGLViewer && make -j4 returned exit code 2
make: *** [debian/rules:4: build-arch] Error 255

Tail of log for acovea on armhf:

 fakeroot debian/rules clean
dh_testdir
dh_testroot
rm -f build-stamp 
# Add here commands to clean up after the build process.
/usr/bin/make distclean
make[1]: Entering directory '/<<PKGBUILDDIR>>'
make[1]: *** No rule to make target 'distclean'.  Stop.
make[1]: Leaving directory '/<<PKGBUILDDIR>>'
make: [debian/rules:49: clean] Error 2 (ignored)
cp -f /usr/share/misc/config.sub config.sub
cp -f /usr/share/misc/config.guess config.guess
dh_clean 
dh_clean: Compatibility levels before 5 are no longer supported (level 4 requested)
make: *** [debian/rules:52: clean] Error 255

Tail of log for mingw32-binutils on armhf:

dpkg-buildpackage
-----------------

dpkg-buildpackage: info: source package mingw32-binutils
dpkg-buildpackage: info: source version 2.20-0.2
dpkg-buildpackage: info: source distribution unstable
 dpkg-source --before-build .
dpkg-buildpackage: info: host architecture armhf
 fakeroot debian/rules clean
dh_testdir
dh_testroot
rm -rf /<<PKGBUILDDIR>>/build_dir *-stamp
dh_clean
dh_clean: Compatibility levels before 5 are no longer supported (level 4 requested)
make: *** [debian/rules:123: clean] Error 255

Tail of log for ocamlgsl on armhf:

+ /usr/bin/ocamlopt.opt unix.cmxa -I /usr/lib/ocaml/ocamlbuild /usr/lib/ocaml/ocamlbuild/ocamlbuildlib.cmxa myocamlbuild.ml /usr/lib/ocaml/ocamlbuild/ocamlbuild.cmx -o myocamlbuild
File "myocamlbuild.ml", line 518, characters 43-62:
518 |                        List.map (fun m -> (String.uncapitalize m) ^ ".cmi")
                                                 ^^^^^^^^^^^^^^^^^^^
Alert deprecated: Ocamlbuild_plugin.String.uncapitalize
Use String.uncapitalize_ascii instead.
File "myocamlbuild.ml", line 531, characters 51-70:
531 |                        List.map (fun m -> dir^"/"^(String.uncapitalize m)^".cmi")
                                                         ^^^^^^^^^^^^^^^^^^^
Alert deprecated: Ocamlbuild_plugin.String.uncapitalize
Use String.uncapitalize_ascii instead.
E: Failure("Command ''/usr/bin/ocamlbuild' lib/libgsl_stubs.a lib/dllgsl_stubs.so lib/gsl.cma lib/gsl.cmxa lib/gsl.a lib/gsl.cmxs examples/blas_ex.native examples/blas_speed_test.native examples/bspline_ex.native examples/cheb_ex.native examples/combi_ex.native examples/const_ex.native examples/deriv_ex.native examples/eigen_ex.native examples/fft_c.native examples/fft_c2.native examples/fft_hc.native examples/fit_ex.native examples/histo_ex.native examples/integration_ex.native examples/interp_ex.native examples/linalg_ex.native examples/min_ex.native examples/monte_ex.native examples/multifit_data_ex.native examples/multifit_nlin_ex.native examples/multimin_ex.native examples/multiroot_ex.native examples/odeiv_ex.native examples/permut_ex.native examples/qrng_ex.native examples/rng_ex.native examples/root_ex.native examples/siman_ex.native examples/siman_tsp_ex.native examples/stats_ex.native examples/sum_ex.native examples/wavelet_ex.native -tag debug -tag tests' terminated with error code 10")
make[1]: *** [debian/rules:22: override_dh_auto_build] Error 1
make[1]: Leaving directory '/<<PKGBUILDDIR>>'
make: *** [debian/rules:9: build-arch] Error 2

Tail of log for asterisk-chan-capi on armhf:

      |  ^~~~~~~~~~~~~~~~~~~~~~~~~~
chan_capi.c:8883:4: warning: implicit declaration of function 'ast_smoother_free'; did you mean 'ast_std_free'? [-Wimplicit-function-declaration]
 8883 |    ast_smoother_free(i->smoother);
      |    ^~~~~~~~~~~~~~~~~
      |    ast_std_free
In file included from chan_capi.h:27,
                 from chan_capi.c:32:
chan_capi.c: In function 'load_module':
chan_capi.c:9009:2: error: 'AST_MODULE_SELF' undeclared (first use in this function); did you mean 'AST_MODULE_INFO'?
 9009 |  ast_register_application(commandapp, pbx_capicommand_exec, commandsynopsis, commandtdesc);
      |  ^~~~~~~~~~~~~~~~~~~~~~~~
make[1]: *** [Makefile:198: chan_capi.o] Error 1
make[1]: Leaving directory '/<<PKGBUILDDIR>>'
dh_auto_build: make -j1 returned exit code 2
make: *** [debian/rules:3: build-arch] Error 255

Tail of log for apf on armhf:

checking for suffix of executables... 
checking for suffix of object files... o
checking whether we are using the GNU C compiler... yes
checking whether arm-linux-gnueabihf-gcc accepts -g... yes
checking for arm-linux-gnueabihf-gcc option to accept ISO C89... none needed
checking for style of include used by make... GNU
checking dependency style of arm-linux-gnueabihf-gcc... gcc3
checking how to run the C preprocessor... arm-linux-gnueabihf-gcc -E
checking for grep that handles long lines and -e... /bin/grep
checking for egrep... /bin/grep -E
checking whether arm-linux-gnueabihf-gcc needs -traditional... no
checking for openssl... no
checking for SSL_library_init in -lssl... no
configure: error: "lib ssl not found!"
make: *** [debian/rules:29: config.status] Error 1

Tail of log for austin on armhf:

# ERROR: 0
============================================================================
See ./test-suite.log
Please report to https://github.com/p403n1x87/austin/issues
============================================================================
make[4]: *** [Makefile:674: test-suite.log] Error 1
make[4]: Leaving directory '/<<PKGBUILDDIR>>'
make[3]: *** [Makefile:782: check-TESTS] Error 2
make[3]: Leaving directory '/<<PKGBUILDDIR>>'
make[2]: *** [Makefile:1006: check-am] Error 2
make[2]: Leaving directory '/<<PKGBUILDDIR>>'
make[1]: *** [Makefile:559: check-recursive] Error 1
make[1]: Leaving directory '/<<PKGBUILDDIR>>'
dh_auto_test: make -j4 check VERBOSE=1 returned exit code 2
make: *** [debian/rules:4: build-arch] Error 255

Tail of log for audacious-analog-vumeter-plugin on armhf:

make[3]: Entering directory '/<<PKGBUILDDIR>>/src'
/bin/bash ../libtool --tag=CC   --mode=compile gcc -DHAVE_CONFIG_H -I. -I..    -Wall -ggdb  -g -O2 -DSKINDIR=\"/usr/share/audacious\" -g -O2 -c -o plugin_main.lo plugin_main.c
libtool: compile:  gcc -DHAVE_CONFIG_H -I. -I.. -Wall -ggdb -g -O2 -DSKINDIR=\"/usr/share/audacious\" -g -O2 -c plugin_main.c  -fPIC -DPIC -o .libs/plugin_main.o
plugin_main.c:1:10: fatal error: gtk/gtk.h: No such file or directory
    1 | #include <gtk/gtk.h>
      |          ^~~~~~~~~~~
compilation terminated.
make[3]: *** [Makefile:321: plugin_main.lo] Error 1
make[3]: Leaving directory '/<<PKGBUILDDIR>>/src'
make[2]: *** [Makefile:365: all-recursive] Error 1
make[2]: Leaving directory '/<<PKGBUILDDIR>>'
make[1]: *** [Makefile:254: all] Error 2
make[1]: Leaving directory '/<<PKGBUILDDIR>>'
dh_auto_build: make -j1 returned exit code 2
make: *** [debian/rules:8: build-arch] Error 255

BinNMU changelog for wine on armhf:

rebuild due to debcheck failure

Tail of log for autofs5 on armhf:

/usr/bin/ld: ../lib/autofs.a(master.o): in function `master_submount_list_empty':
master.c:(.text+0x168c): undefined reference to `dump_core'
/usr/bin/ld: master.c:(.text+0x16ac): undefined reference to `dump_core'
/usr/bin/ld: ../lib/autofs.a(master.o):master.c:(.text+0x192c): more undefined references to `dump_core' follow
/usr/bin/ld: ../lib/autofs.a(master.o): in function `master_mount_mounts':
master.c:(.text+0x1fb4): undefined reference to `pthread_create'
/usr/bin/ld: master.c:(.text+0x212c): undefined reference to `dump_core'
/usr/bin/ld: ../lib/autofs.a(master.o): in function `master_done':
master.c:(.text+0x2294): undefined reference to `pthread_join'
collect2: error: ld returned 1 exit status
make[2]: *** [Makefile:28: automount] Error 1
make[2]: Leaving directory '/<<PKGBUILDDIR>>/daemon'
make[1]: *** [Makefile:14: daemon] Error 2
make[1]: Leaving directory '/<<PKGBUILDDIR>>'
make: *** [debian/rules:23: build.stamp] Error 2

Tail of log for criu on armhf:

  192 | #define PTRACE_SETSIGMASK PTRACE_SETSIGMASK
      | 
In file included from include/protobuf.h:8,
                 from arch/arm/crtools.c:9:
include/util.h: In function 'kdev_to_odev':
include/util.h:158:9: error: implicit declaration of function 'makedev' [-Werror=implicit-function-declaration]
  158 |  return makedev(major, minor);
      |         ^~~~~~~
cc1: all warnings being treated as errors
make[2]: *** [scripts/Makefile.build:185: arch/arm/crtools.o] Error 1
make[2]: Leaving directory '/<<PKGBUILDDIR>>'
make[1]: *** [Makefile:208: arch/arm] Error 2
make[1]: Leaving directory '/<<PKGBUILDDIR>>'
dh_auto_build: make -j4 returned exit code 2
make: *** [debian/rules:6: build-arch] Error 255

Tail of log for consul-migrate on armhf:

    migrator_test.go:60: err: MDB_INVALID: File is not an LMDB file
=== RUN   TestMigrator_new
--- PASS: TestMigrator_new (0.00s)
=== RUN   TestMigrator_migrate
--- FAIL: TestMigrator_migrate (0.00s)
    migrator_test.go:130: err: Failed to connect MDB: MDB_INVALID: File is not an LMDB file %!s(MISSING)
=== RUN   TestMigrator_migrate_fails
--- PASS: TestMigrator_migrate_fails (0.17s)
=== RUN   TestMigrator_migrate_noop
--- PASS: TestMigrator_migrate_noop (0.00s)
FAIL
FAIL	github.com/hashicorp/consul-migrate/migrator	0.375s
FAIL
dh_auto_test: cd obj-arm-linux-gnueabihf && go test -vet=off -v -p 1 github.com/hashicorp/consul-migrate github.com/hashicorp/consul-migrate/migrator returned exit code 1
make: *** [debian/rules:7: build-arch] Error 255

Tail of log for cryptominisat on armhf:

- _ZSt22__final_insertion_sortIN9__gnu_cxx17__normal_iteratorIPN5CMSat3LitESt6vectorIS3_SaIS3_EEEENS0_5__ops15_Iter_comp_iterINS2_5Stamp14StampSorterInvEEEEvT_SE_T0_@Base 5.6.3
+#MISSING: 5.6.4+dfsg.1-1# _ZSt22__final_insertion_sortIN9__gnu_cxx17__normal_iteratorIPN5CMSat3LitESt6vectorIS3_SaIS3_EEEENS0_5__ops15_Iter_comp_iterINS2_5Stamp11StampSorterEEEEvT_SE_T0_@Base 5.6.3
+#MISSING: 5.6.4+dfsg.1-1# _ZSt22__final_insertion_sortIN9__gnu_cxx17__normal_iteratorIPN5CMSat3LitESt6vectorIS3_SaIS3_EEEENS0_5__ops15_Iter_comp_iterINS2_5Stamp14StampSorterInvEEEEvT_SE_T0_@Base 5.6.3
  _ZSt22__final_insertion_sortIN9__gnu_cxx17__normal_iteratorIPN5CMSat3LitESt6vectorIS3_SaIS3_EEEENS0_5__ops15_Iter_less_iterEEvT_SB_T0_@Base 5.6.3
  _ZSt22__final_insertion_sortIN9__gnu_cxx17__normal_iteratorIPjSt6vectorIjSaIjEEEENS0_5__ops15_Iter_less_iterEEvT_S9_T0_@Base 5.6.3
  _ZSt22__move_median_to_firstIN9__gnu_cxx17__normal_iteratorIPN5CMSat3BVA15PotentialClauseESt6vectorIS4_SaIS4_EEEENS0_5__ops15_Iter_less_iterEEvT_SC_SC_SC_T0_@Base 5.6.3
- _ZSt22__move_median_to_firstIPN5CMSat7WatchedEN9__gnu_cxx5__ops15_Iter_comp_iterINS0_13OccSimplifier25watch_sort_smallest_firstEEEEvT_S9_S9_S9_T0_@Base 5.6.3
+ _ZSt22__move_median_to_firstIPN5CMSat7WatchedEN9__gnu_cxx5__ops15_Iter_comp_iterI11MyOccSorterEEEvT_S8_S8_S8_T0_@Base 5.6.4+dfsg.1-1
+#MISSING: 5.6.4+dfsg.1-1# _ZSt22__move_median_to_firstIPN5CMSat7WatchedEN9__gnu_cxx5__ops15_Iter_comp_iterINS0_13OccSimplifier25watch_sort_smallest_firstEEEEvT_S9_S9_S9_T0_@Base 5.6.3
+ _ZSt22__move_median_to_firstIPN5CMSat7WatchedEN9__gnu_cxx5__ops15_Iter_comp_iterINS0_21WatchSorterBinTriLongEEEEvT_S8_S8_S8_T0_@Base 5.6.4+dfsg.1-1
  _ZSt25__unguarded_linear_insertIN9__gnu_cxx17__normal_iteratorIPN5CMSat11OccurClauseESt6vectorIS3_SaIS3_EEEENS0_5__ops14_Val_comp_iterISt8functionIFbRKS3_SD_EEEEEvT_T0_@Base 5.6.3
  _ZSt25__unguarded_linear_insertIN9__gnu_cxx17__normal_iteratorIPN5CMSat3BVA15PotentialClauseESt6vectorIS4_SaIS4_EEEENS0_5__ops14_Val_less_iterEEvT_T0_@Base 5.6.3
  _ZSt25__unguarded_linear_insertIN9__gnu_cxx17__normal_iteratorIPN5CMSat3LitESt6vectorIS3_SaIS3_EEEENS0_5__ops14_Val_comp_iterINS2_5Stamp11StampSorterEEEEvT_T0_@Base 5.6.3
dh_makeshlibs: failing due to earlier errors
make: *** [debian/rules:8: binary-arch] Error 255

Tail of log for djbdns on armhf:

 dpkg-source --before-build .
dpkg-buildpackage: info: host architecture armhf
 fakeroot debian/rules clean
rm -f `cat TARGETS`
for i in dbndns/*; do test -d $i || rm -f $i; done
test ! -e patch-stamp || \
  for i in `ls -1r debian/diff/*.diff || :`; do patch -p1 -R <$i; done
rm -f configure-stamp patch-stamp build-stamp \
  dbndns/patch-stamp dbndns/build-stamp
rm -rf '/<<PKGBUILDDIR>>/debian/djbdns' '/<<PKGBUILDDIR>>/debian/dbndns' '/<<PKGBUILDDIR>>/debian/dnscache-run'
rm -f debian/files debian/substvars changelog
test ! -r conf-home'{orig}' || mv -f conf-home'{orig}' conf-home
test ! -r conf-cc'{orig}' || mv conf-cc'{orig}' conf-cc
 debian/rules build-arch
make: *** No rule to make target 'build-arch'.  Stop.

Tail of log for blastem on armhf:

z80_to_x86.c: In function 'zremove_breakpoint':
z80_to_x86.c:3872:22: warning: assignment to 'code_ptr' {aka 'unsigned int *'} from incompatible pointer type 'uint8_t *' {aka 'unsigned char *'} [-Wincompatible-pointer-types]
 3872 |   opts->gen.code.cur = native;
      |                      ^
z80_to_x86.c:3873:23: warning: assignment to 'code_ptr' {aka 'unsigned int *'} from incompatible pointer type 'uint8_t *' {aka 'unsigned char *'} [-Wincompatible-pointer-types]
 3873 |   opts->gen.code.last = native + 128;
      |                       ^
cc -o dis dis.o 68kinst.o tern.o vos_program_module.o -O2 -flto -g -fPIE -D_FORTIFY_SOURCE=2 -fstack-protector-strong -Wformat -Werror=format-security -O2 -flto -g -fPIE -D_FORTIFY_SOURCE=2 -fstack-protector-strong -Wformat -Werror=format-security -lm -lSDL2 -lGLEW -lGLU -lGL -lz -Wl,-z,relro -Wl,-z,now -fPIE -pie
make[2]: *** [Makefile:356: z80_to_x86.o] Error 1
make[2]: *** Waiting for unfinished jobs....
make[2]: Leaving directory '/<<PKGBUILDDIR>>'
dh_auto_build: make -j4 "INSTALL=install --strip-program=true" HOST_ZLIB=1 CONFIG_PATH=/etc/blastem DATA_PATH=/usr/share/games/blastem returned exit code 2
make[1]: *** [debian/rules:10: override_dh_auto_build] Error 255
make[1]: Leaving directory '/<<PKGBUILDDIR>>'
make: *** [debian/rules:7: binary-arch] Error 2

Tail of log for dustrac on armhf:

    Feature record: CXX_FEATURE:0cxx_strong_enums
    Feature record: CXX_FEATURE:1cxx_template_template_parameters
    Feature record: CXX_FEATURE:0cxx_thread_local
    Feature record: CXX_FEATURE:0cxx_trailing_return_types
    Feature record: CXX_FEATURE:0cxx_unicode_literals
    Feature record: CXX_FEATURE:0cxx_uniform_initialization
    Feature record: CXX_FEATURE:0cxx_unrestricted_unions
    Feature record: CXX_FEATURE:0cxx_user_literals
    Feature record: CXX_FEATURE:0cxx_variable_templates
    Feature record: CXX_FEATURE:0cxx_variadic_macros
    Feature record: CXX_FEATURE:0cxx_variadic_templates
dh_auto_configure: cd obj-arm-linux-gnueabihf && cmake -DCMAKE_INSTALL_PREFIX=/usr -DCMAKE_BUILD_TYPE=None -DCMAKE_INSTALL_SYSCONFDIR=/etc -DCMAKE_INSTALL_LOCALSTATEDIR=/var -DCMAKE_EXPORT_NO_PACKAGE_REGISTRY=ON -DCMAKE_FIND_PACKAGE_NO_PACKAGE_REGISTRY=ON "-GUnix Makefiles" -DCMAKE_VERBOSE_MAKEFILE=ON -DCMAKE_INSTALL_LIBDIR=lib/arm-linux-gnueabihf -DReleaseBuild=ON -DBIN_PATH=/usr/games/ -DDOC_PATH=/usr/share/doc/dustracing2d/ -DDATA_PATH=/usr/share/games/dustracing2d/ .. returned exit code 1
make[1]: *** [debian/rules:9: override_dh_auto_configure] Error 2
make[1]: Leaving directory '/<<PKGBUILDDIR>>'
make: *** [debian/rules:6: build-arch] Error 2

Tail of log for debiman on armhf:

--- PASS: TestCronSection (0.00s)
    --- PASS: TestCronSection/cron (0.00s)
PASS
ok  	github.com/Debian/debiman/internal/redirect	0.110s
=== RUN   TestSitemap
--- PASS: TestSitemap (0.00s)
=== RUN   TestSitemapIndex
--- PASS: TestSitemapIndex (0.00s)
PASS
ok  	github.com/Debian/debiman/internal/sitemap	0.032s
?   	github.com/Debian/debiman/internal/tag	[no test files]
?   	github.com/Debian/debiman/internal/write	[no test files]
FAIL
dh_auto_test: cd obj-arm-linux-gnueabihf && go test -vet=off -v -p 4 github.com/Debian/debiman github.com/Debian/debiman/cmd/debiman github.com/Debian/debiman/cmd/debiman-auxserver github.com/Debian/debiman/cmd/debiman-idx2rwmap github.com/Debian/debiman/cmd/debiman-minisrv github.com/Debian/debiman/internal/aux github.com/Debian/debiman/internal/bundled github.com/Debian/debiman/internal/commontmpl github.com/Debian/debiman/internal/convert github.com/Debian/debiman/internal/manpage github.com/Debian/debiman/internal/proto github.com/Debian/debiman/internal/recode github.com/Debian/debiman/internal/redirect github.com/Debian/debiman/internal/sitemap github.com/Debian/debiman/internal/tag github.com/Debian/debiman/internal/write returned exit code 1
make: *** [debian/rules:4: binary-arch] Error 255

Tail of log for ezquake on armhf:

 1369 |  snprintf(name, MAX_OSPATH, "%s/%s.log", fs_gamedir, G_STRING(OFS_PARM0));
      |                                   ^~~~
In file included from /usr/include/stdio.h:867,
                 from q_shared.h:30,
                 from common.h:35,
                 from qwsvdef.h:26,
                 from pr_cmds.c:22:
/usr/include/arm-linux-gnueabihf/bits/stdio2.h:67:10: note: '__builtin___snprintf_chk' output 6 or more bytes (assuming 133) into a destination of size 128
   67 |   return __builtin___snprintf_chk (__s, __n, __USE_FORTIFY_LEVEL - 1,
      |          ^~~~~~~~~~~~~~~~~~~~~~~~~~~~~~~~~~~~~~~~~~~~~~~~~~~~~~~~~~~~
   68 |        __bos (__s), __fmt, __va_arg_pack ());
      |        ~~~~~~~~~~~~~~~~~~~~~~~~~~~~~~~~~~~~~
make[1]: Leaving directory '/<<BUILDDIR>>/ezquake-2.2+git20150324'
dh_auto_build: make -j4 returned exit code 2
make: *** [debian/rules:14: build-arch] Error 255

Tail of log for dxvk on armhf:

Appending CPPFLAGS from environment: '-Wdate-time -D_FORTIFY_SOURCE=2'
C compiler for the build machine: cc (gcc 9.2.1 "cc (Raspbian 9.2.1-17+rpi1) 9.2.1 20191102")
C linker for the build machine: GNU ld.bfd 2.33.1
Appending CXXFLAGS from environment: '-g -O2 -fdebug-prefix-map=/<<BUILDDIR>>/dxvk-1.4.3+ds1=. -fstack-protector-strong -Wformat -Werror=format-security'
Appending LDFLAGS from environment: ['-Wl,-z,relro']
Appending CPPFLAGS from environment: '-Wdate-time -D_FORTIFY_SOURCE=2'
C++ compiler for the build machine: c++ (gcc 9.2.1 "c++ (Raspbian 9.2.1-17+rpi1) 9.2.1 20191102")
C++ linker for the build machine: GNU ld.bfd 2.33.1

meson.build:1:0: ERROR: Compiler /usr/lib/wine-development/winegcc can not compile programs.

A full log can be found at /<<BUILDDIR>>/dxvk-1.4.3+ds1/build-wine32/meson-logs/meson-log.txt
make[1]: *** [debian/rules:32: override_dh_auto_configure] Error 1
make[1]: Leaving directory '/<<BUILDDIR>>/dxvk-1.4.3+ds1'
make: *** [debian/rules:4: build-arch] Error 2

Tail of log for fuse-umfuse-iso9660 on armhf:

checking whether the gcc linker (/usr/bin/ld) supports shared libraries... yes
checking whether -lc should be explicitly linked in... no
checking dynamic linker characteristics... GNU/Linux ld.so
checking how to hardcode library paths into programs... immediate
checking whether stripping libraries is possible... yes
checking if libtool supports shared libraries... yes
checking whether to build shared libraries... yes
checking whether to build static libraries... yes
checking for fuse_main in -lfuse... yes
checking for iso9660_open_ext in -liso9660... yes
checking for _cdio_list_begin in -lcdio... yes
checking for uncompress in -lz... yes
checking for um_add_service in -lumlib... no
configure: error: Can't find libumlib, please install it
make: *** [/usr/share/cdbs/1/class/autotools.mk:46: debian/stamp-autotools] Error 1

Tail of log for febootstrap on armhf:

File "febootstrap_utils.ml", line 85, characters 42-46:
85 |   really_input chan data 0 (String.length data);
                                               ^^^^
Error: This expression has type bytes but an expression was expected of type
         string
make[4]: *** [Makefile:1275: febootstrap_utils.cmx] Error 2
make[4]: Leaving directory '/<<PKGBUILDDIR>>/src'
make[3]: *** [Makefile:1058: all-recursive] Error 1
make[3]: Leaving directory '/<<PKGBUILDDIR>>'
make[2]: *** [Makefile:996: all] Error 2
make[2]: Leaving directory '/<<PKGBUILDDIR>>'
dh_auto_build: make -j1 returned exit code 2
make[1]: *** [debian/rules:8: override_dh_auto_build] Error 255
make[1]: Leaving directory '/<<PKGBUILDDIR>>'
make: *** [debian/rules:11: build-arch] Error 2

Tail of log for golang-github-anacrolix-missinggo on armhf:

?   	github.com/anacrolix/missinggo/runid	[no test files]
=== RUN   TestCastSliceInterface
--- PASS: TestCastSliceInterface (0.00s)
=== RUN   TestCastSliceInts
--- PASS: TestCastSliceInts (0.00s)
=== RUN   TestFromMap
--- PASS: TestFromMap (0.00s)
=== RUN   TestSort
--- PASS: TestSort (0.00s)
PASS
ok  	github.com/anacrolix/missinggo/slices	0.009s
?   	github.com/anacrolix/missinggo/x	[no test files]
FAIL
dh_auto_test: cd obj-arm-linux-gnueabihf && go test -vet=off -v -p 4 github.com/anacrolix/missinggo github.com/anacrolix/missinggo/bitmap github.com/anacrolix/missinggo/cache github.com/anacrolix/missinggo/chans github.com/anacrolix/missinggo/cmd/filecache github.com/anacrolix/missinggo/cmd/gd github.com/anacrolix/missinggo/cmd/go-env github.com/anacrolix/missinggo/cmd/http-file-server github.com/anacrolix/missinggo/cmd/nop github.com/anacrolix/missinggo/cmd/query-escape github.com/anacrolix/missinggo/cmd/query-unescape github.com/anacrolix/missinggo/conntrack github.com/anacrolix/missinggo/container/xheap github.com/anacrolix/missinggo/ctrlflow github.com/anacrolix/missinggo/docopt github.com/anacrolix/missinggo/expect github.com/anacrolix/missinggo/filecache github.com/anacrolix/missinggo/futures github.com/anacrolix/missinggo/httpfile github.com/anacrolix/missinggo/httpmux github.com/anacrolix/missinggo/httptoo github.com/anacrolix/missinggo/inproc github.com/anacrolix/missinggo/iter github.com/anacrolix/missinggo/leaktest github.com/anacrolix/missinggo/mime github.com/anacrolix/missinggo/oauth github.com/anacrolix/missinggo/orderedmap github.com/anacrolix/missinggo/panicif github.com/anacrolix/missinggo/patreon github.com/anacrolix/missinggo/perf github.com/anacrolix/missinggo/pproffd github.com/anacrolix/missinggo/prioritybitmap github.com/anacrolix/missinggo/prometheus github.com/anacrolix/missinggo/pubsub github.com/anacrolix/missinggo/refclose github.com/anacrolix/missinggo/reqctx github.com/anacrolix/missinggo/resource github.com/anacrolix/missinggo/runid github.com/anacrolix/missinggo/slices github.com/anacrolix/missinggo/x returned exit code 2
make: *** [debian/rules:4: binary-arch] Error 255

Tail of log for gatb-core on armhf:

/usr/bin/ld: /usr/include/c++/9/bits/atomic_base.h:419: undefined reference to `__atomic_load_8'
/usr/bin/ld: /usr/include/c++/9/bits/atomic_base.h:419: undefined reference to `__atomic_load_8'
/usr/bin/ld: CMakeFiles/gatb-core-cppunit.dir/src/bcalm/TestBcalm.cpp.o: in function `std::__atomic_base<unsigned long long>::compare_exchange_weak(unsigned long long&, unsigned long long, std::memory_order, std::memory_order)':
/usr/include/c++/9/bits/atomic_base.h:457: undefined reference to `__atomic_compare_exchange_8'
collect2: error: ld returned 1 exit status
make[4]: *** [test/unit/CMakeFiles/gatb-core-cppunit.dir/build.make:440: bin/None/gatb-core-cppunit] Error 1
make[4]: Leaving directory '/<<BUILDDIR>>/gatb-core-1.4.1+git20190813.a73b6dd+dfsg/obj-arm-linux-gnueabihf'
make[3]: *** [CMakeFiles/Makefile2:338: test/unit/CMakeFiles/gatb-core-cppunit.dir/all] Error 2
make[3]: Leaving directory '/<<BUILDDIR>>/gatb-core-1.4.1+git20190813.a73b6dd+dfsg/obj-arm-linux-gnueabihf'
make[2]: *** [Makefile:155: all] Error 2
make[2]: Leaving directory '/<<BUILDDIR>>/gatb-core-1.4.1+git20190813.a73b6dd+dfsg/obj-arm-linux-gnueabihf'
dh_auto_build: cd obj-arm-linux-gnueabihf && make -j4 "INSTALL=install --strip-program=true" returned exit code 2
make[1]: *** [debian/rules:13: override_dh_auto_build-arch] Error 255
make[1]: Leaving directory '/<<BUILDDIR>>/gatb-core-1.4.1+git20190813.a73b6dd+dfsg'
make: *** [debian/rules:10: build-arch] Error 2

Tail of log for guile-ssh on armhf:

See tests/test-suite.log
Please report to poptsov.artyom@gmail.com
============================================================================
make[5]: *** [Makefile:656: test-suite.log] Error 1
make[5]: Leaving directory '/<<PKGBUILDDIR>>/tests'
make[4]: *** [Makefile:764: check-TESTS] Error 2
make[4]: Leaving directory '/<<PKGBUILDDIR>>/tests'
make[3]: *** [Makefile:830: check-am] Error 2
make[3]: Leaving directory '/<<PKGBUILDDIR>>/tests'
make[2]: *** [Makefile:414: check-recursive] Error 1
make[2]: Leaving directory '/<<PKGBUILDDIR>>'
dh_auto_test: make -j1 check VERBOSE=1 returned exit code 2
make[1]: *** [debian/rules:7: override_dh_auto_test] Error 255
make[1]: Leaving directory '/<<PKGBUILDDIR>>'
make: *** [debian/rules:4: build-arch] Error 2

Tail of log for libqt4pas on armhf:

+#MISSING: 2.5-15# (optional=templinst|arch=armel armhf i386 powerpc|subst)_ZN5QListI{qreal}E6appendERK{qreal}@Base 2.5
  (optional=templinst|arch=arm64 armel armhf powerpc ppc64|subst)_ZN5QListI{qreal}ED1Ev@Base 2.5
  (optional=templinst|arch=arm64 armel armhf powerpc ppc64|subst)_ZN5QListI{qreal}ED2Ev@Base 2.5
  (arch=arm64 armel armhf powerpc ppc64)_ZN7QStringD1Ev@Base 2.5
@@ -8570,7 +8570,7 @@
  _ZNK12QDialog_hook10metaObjectEv@Base 2.4
  _ZNK12QLayout_hook10metaObjectEv@Base 2.4
  _ZNK12QObject_hook10metaObjectEv@Base 2.4
- (arch=amd64 arm64 i386 powerpc ppc64 sparc)_ZNK12QPaintDevice7devTypeEv@Base 2.5
+ _ZNK12QPaintDevice7devTypeEv@Base 2.5
  _ZNK12QSlider_hook10metaObjectEv@Base 2.4
  _ZNK12QTabBar_hook10metaObjectEv@Base 2.4
  _ZNK12QThread_hook10metaObjectEv@Base 2.4
dh_makeshlibs: failing due to earlier errors
make: *** [debian/rules:13: binary-arch] Error 255

Tail of log for haskell-heterocephalus on armhf:

doctest: 
doctest:   -Mgrace=<n>
doctest:             The amount of allocation after the program receives a
doctest:             HeapOverflow exception before the exception is thrown again, if
doctest:             the program is still exceeding the heap limit.
doctest: 
doctest: RTS options may also be specified using the GHCRTS environment variable.
doctest: 
doctest: Other RTS options may be available for programs compiled a different way.
doctest: The GHC User's Guide has full details.
doctest: 
Test suite doctest: FAIL
Test suite logged to: dist-ghc/test/heterocephalus-1.0.5.3-doctest.log
0 of 2 test suites (0 of 2 test cases) passed.
make: *** [/usr/share/cdbs/1/class/hlibrary.mk:154: check-ghc-stamp] Error 1

Tail of log for gammapy on armhf:

/usr/lib/python3/dist-packages/astropy_helpers/setup_helpers.py:174: AstropyDeprecationWarning: The release argument to generate_version_py has been deprecated and will be removed in future. We now use the presence of the "dev" string in the version to determine whether this is a release
  'determine whether this is a release', AstropyDeprecationWarning)
/usr/lib/python3/dist-packages/astropy_helpers/setup_helpers.py:188: AstropyDeprecationWarning: Specifying the package name using the "package_name" option in setup.cfg is deprecated - use the "name" option instead.
  'option instead.', AstropyDeprecationWarning)
/usr/lib/python3/dist-packages/astropy_helpers/version_helpers.py:241: AstropyDeprecationWarning: The packagename argument to generate_version_py has been deprecated and will be removed in future. Specify the package name in setup.cfg instead
  'the package name in setup.cfg instead', AstropyDeprecationWarning)
/usr/lib/python3/dist-packages/astropy_helpers/version_helpers.py:246: AstropyDeprecationWarning: The version argument to generate_version_py has been deprecated and will be removed in future. Specify the version number in setup.cfg instead
  'the version number in setup.cfg instead', AstropyDeprecationWarning)
/usr/lib/python3/dist-packages/astropy_helpers/version_helpers.py:252: AstropyDeprecationWarning: The release argument to generate_version_py has been deprecated and will be removed in future. We now use the presence of the "dev" string in the version to determine whether this is a release
  'determine whether this is a release', AstropyDeprecationWarning)
/usr/lib/python3/dist-packages/astropy_helpers/version_helpers.py:266: AstropyDeprecationWarning: Specifying the package name using the "package_name" option in setup.cfg is deprecated - use the "name" option instead.
  'option instead.', AstropyDeprecationWarning)
make[1]: *** [debian/rules:21: test-python3.7] Error 1
make[1]: Leaving directory '/<<PKGBUILDDIR>>'
make: *** [debian/rules:9: build-arch] Error 2

Tail of log for haskell-type-level on armhf:

    |
266 | instance (DivMod x y q r) => Div x y q
    |          ^^^^^^^^^^^^^^^^^^^^^^^^^^^^^

src/Data/TypeLevel/Num/Ops.hs:336:10: error:
    * Illegal instance declaration for `Div10 x q'
        The liberal coverage condition fails in class `Div10'
          for functional dependency: `q -> x'
        Reason: lhs type `q' does not determine rhs type `x'
        Un-determined variable: x
    * In the instance declaration for `Div10 x q'
    |
336 | instance DivMod10 x q r => Div10 x q
    |          ^^^^^^^^^^^^^^^^^^^^^^^^^^^
make: *** [/usr/share/cdbs/1/class/hlibrary.mk:147: build-ghc-stamp] Error 1

Tail of log for haskell-pretty-simple on armhf:

pretty-simple-doctest:   -Mgrace=<n>
pretty-simple-doctest:             The amount of allocation after the program receives a
pretty-simple-doctest:             HeapOverflow exception before the exception is thrown again, if
pretty-simple-doctest:             the program is still exceeding the heap limit.
pretty-simple-doctest: 
pretty-simple-doctest: RTS options may also be specified using the GHCRTS environment variable.
pretty-simple-doctest: 
pretty-simple-doctest: Other RTS options may be available for programs compiled a different way.
pretty-simple-doctest: The GHC User's Guide has full details.
pretty-simple-doctest: 
Test suite pretty-simple-doctest: FAIL
Test suite logged to:
dist-ghc/test/pretty-simple-2.2.0.1-pretty-simple-doctest.log
0 of 1 test suites (0 of 1 test cases) passed.
make: *** [/usr/share/cdbs/1/class/hlibrary.mk:154: check-ghc-stamp] Error 1

Tail of log for ioapps on armhf:

      |                                    ^
replicate.c:1397:11: note: 'first_call_orig' was declared here
 1397 |  uint64_t first_call_orig; ///< when was the first original call made
      |           ^~~~~~~~~~~~~~~
replicate.c:104:36: warning: 'last_call_orig' may be used uninitialized in this function [-Wmaybe-uninitialized]
  104 |      diff_orig = CALL_TIME(x##_it) - last_call_orig; \
      |                                    ^
replicate.c:1396:11: note: 'last_call_orig' was declared here
 1396 |  uint64_t last_call_orig; ///< when was the last original call made
      |           ^~~~~~~~~~~~~~
make[2]: *** [Makefile:46: replicate.o] Error 1
make[2]: Leaving directory '/<<PKGBUILDDIR>>'
make[1]: *** [debian/rules:18: override_dh_auto_build] Error 2
make[1]: Leaving directory '/<<PKGBUILDDIR>>'
make: *** [debian/rules:14: build-arch] Error 2

Tail of log for ibam on armhf:

make[1]: Entering directory '/<<PKGBUILDDIR>>'
make[1]: 'ibam-krell.so' is up to date.
make[1]: Leaving directory '/<<PKGBUILDDIR>>'
touch build-stamp
dh_testdir
dh_testroot
dh_clean
dh_clean: Compatibility levels before 9 are deprecated (level 7 in use)
dh_installdirs
dh_installdirs: Compatibility levels before 9 are deprecated (level 7 in use)
# Add here commands to install the package into debian/tmp.
install -m0755 ibam `pwd`/debian/ibam/usr/bin
install -m0644 ibam-krell.so `pwd`/debian/gkrellm-ibam/usr/lib/gkrellm2/plugins
install: cannot create regular file '/<<PKGBUILDDIR>>/debian/gkrellm-ibam/usr/lib/gkrellm2/plugins': No such file or directory
make: *** [debian/rules:58: install] Error 1

Tail of log for jocaml on armhf:

|---
| tools/ocamlmklib.ml | 5 +++++
| 1 file changed, 5 insertions(+)
|
|diff --git a/tools/ocamlmklib.ml b/tools/ocamlmklib.ml
|index b5c0aee..b4e45d1 100644
|--- a/tools/ocamlmklib.ml
|+++ b/tools/ocamlmklib.ml
--------------------------
No file to patch.  Skipping patch.
1 out of 1 hunk ignored
Patch debian/patches/0003-Don-t-use-rpath.patch does not apply (enforce with -f)
make[1]: *** [debian/rules:22: override_dh_auto_configure] Error 1
make[1]: Leaving directory '/<<PKGBUILDDIR>>'
make: *** [debian/rules:85: build-arch] Error 2

Tail of log for libmath-int128-perl on armhf:

Checking for strings.h... yes
Checking for inttypes.h... yes
Checking for stdint.h... yes
Checking for unistd.h... yes
Checking for uint64_t... yes
Checking for __int128... no
Checking for uint64_t... (cached) yes
Checking for int __attribute__ ((__mode__ (TI)))... 
  It looks like your compiler doesn't support a 128-bit integer type (one of
  "int __attribute__ ((__mode__ (TI)))" or "__int128"). One of these types is
  necessary to compile the Math::Int128 module.

no
dh_auto_configure: perl Makefile.PL INSTALLDIRS=vendor "OPTIMIZE=-g -O2 -fdebug-prefix-map=/<<PKGBUILDDIR>>=. -fstack-protector-strong -Wformat -Werror=format-security -Wdate-time -D_FORTIFY_SOURCE=2" "LD=arm-linux-gnueabihf-gcc -g -O2 -fdebug-prefix-map=/<<PKGBUILDDIR>>=. -fstack-protector-strong -Wformat -Werror=format-security -Wl,-z,relro -Wl,-z,now" returned exit code 1
make: *** [debian/rules:6: build-arch] Error 255

Tail of log for libmlx5 on armhf:

#define HAVE_STDLIB_H 1
#define HAVE_STRING_H 1
#define HAVE_MEMORY_H 1
#define HAVE_STRINGS_H 1
#define HAVE_INTTYPES_H 1
#define HAVE_STDINT_H 1
#define HAVE_UNISTD_H 1
#define HAVE_DLFCN_H 1
#define LT_OBJDIR ".libs/"
#define NVALGRIND 1
#define HAVE_LIBIBVERBS 1

configure: exit 1
dh_auto_configure: ./configure --build=arm-linux-gnueabihf --prefix=/usr --includedir=\${prefix}/include --mandir=\${prefix}/share/man --infodir=\${prefix}/share/info --sysconfdir=/etc --localstatedir=/var --disable-silent-rules --libdir=\${prefix}/lib/arm-linux-gnueabihf --libexecdir=\${prefix}/lib/arm-linux-gnueabihf --disable-maintainer-mode --disable-dependency-tracking returned exit code 1
make: *** [debian/rules:6: build-arch] Error 255

Tail of log for libretro-mupen64plus on armhf:

                 from ./libretro/opengl_state_machine.h:4,
                 from ./libretro/SDL_opengles2.h:29,
                 from gles2rice/src/osal_opengl.h:33,
                 from gles2rice/src/DeviceBuilder.cpp:21:
/usr/include/GLES2/gl2ext.h:3070:16: note: previous declaration as 'typedef double GLdouble'
 3070 | typedef double GLdouble;
      |                ^~~~~~~~
g++ -Wdate-time -D_FORTIFY_SOURCE=2 -g -fdebug-prefix-map=/<<BUILDDIR>>/libretro-mupen64plus-2.0+git20160207+dfsg2=. -fstack-protector-strong -Wformat -Werror=format-security -std=gnu++98 -MMD -O2 -DNDEBUG  -DHAVE_NEON -D__LIBRETRO__ -DINLINE="inline" -DM64P_PLUGIN_API -DM64P_CORE_PROTOTYPES -D_ENDUSER_RELEASE -DSDL_VIDEO_OPENGL_ES2=1 -DSINC_LOWER_QUALITY -DHAVE_COMBINE_EXT  -I./mupen64plus-core/src -I./mupen64plus-core/src/api -I./mupen64plus-core/src/plugin/audio_libretro -I./glide2gl/src/Glitch64/inc -I./libretro-common/include -I./libretro -DARM -fPIC -DARM  -DNO_ASM -DARM -D__arm__ -DARM_ASM -DNOSSE -marm -D__NEON_OPT -mfpu=neon -mfloat-abi=hard -DGLES -DHAVE_OPENGLES2 -DDISABLE_3POINT -DUSE_GLES  -DNEW_DYNAREC=3 -DDYNAREC -c gles2rice/src/FrameBuffer.cpp -o gles2rice/src/FrameBuffer.o
make[2]: *** [Makefile:408: gles2rice/src/DeviceBuilder.o] Error 1
make[2]: *** Waiting for unfinished jobs....
make[2]: Leaving directory '/<<BUILDDIR>>/libretro-mupen64plus-2.0+git20160207+dfsg2'
dh_auto_build: make -j4 "platform=armv gles neon hardfloat" returned exit code 2
make[1]: *** [debian/rules:19: override_dh_auto_build] Error 255
make[1]: Leaving directory '/<<BUILDDIR>>/libretro-mupen64plus-2.0+git20160207+dfsg2'
make: *** [debian/rules:16: build-arch] Error 2

Tail of log for libnunc-stans on armhf:

mkdir -p bin
mkdir -p obj
gcc -MM -std=c99 -I"src" -I"inc" src/abstraction/abstraction_dcas.c >obj/abstraction_dcas.d
gcc -g -O2 -fdebug-prefix-map=/<<PKGBUILDDIR>>=. -fstack-protector-strong -Wformat -Werror=format-security  -c -fpic -Wno-unknown-pragmas -std=c99 -I"src" -I"inc"  -o obj/abstraction_dcas.o src/abstraction/abstraction_dcas.c
/tmp/ccZTVLjF.s: Assembler messages:
/tmp/ccZTVLjF.s:76: Error: selected processor does not support `ldrexd r6,r7,[ip]' in ARM mode
/tmp/ccZTVLjF.s:76: Error: selected processor does not support `strexd r0,r2,r3,[ip]' in ARM mode
make[3]: *** [makefile.linux:79: obj/abstraction_dcas.o] Error 1
make[3]: Leaving directory '/<<PKGBUILDDIR>>/liblfds'
make[2]: *** [Makefile:921: all-recursive] Error 1
make[2]: Leaving directory '/<<PKGBUILDDIR>>'
make[1]: *** [Makefile:646: all] Error 2
make[1]: Leaving directory '/<<PKGBUILDDIR>>'
dh_auto_build: make -j1 returned exit code 2
make: *** [debian/rules:21: build-arch] Error 255

Tail of log for lib3mf on armhf:

+ _ZTVSt23_Sp_counted_ptr_inplaceIN3NMR5CUUIDESaIS1_ELN9__gnu_cxx12_Lock_policyE1EE@Base 1.8.0
+#MISSING: 1.8.1+ds-3# (arch=!armel !riscv64)_ZTVSt23_Sp_counted_ptr_inplaceIN3NMR5CUUIDESaIS1_ELN9__gnu_cxx12_Lock_policyE2EE@Base 1.8.0
+ _ZTVSt23_Sp_counted_ptr_inplaceIN3NMR6CModelESaIS1_ELN9__gnu_cxx12_Lock_policyE1EE@Base 1.8.0
+#MISSING: 1.8.1+ds-3# (arch=!armel !riscv64)_ZTVSt23_Sp_counted_ptr_inplaceIN3NMR6CModelESaIS1_ELN9__gnu_cxx12_Lock_policyE2EE@Base 1.8.0
+ _ZTVSt23_Sp_counted_ptr_inplaceIN3NMR6CSliceESaIS1_ELN9__gnu_cxx12_Lock_policyE1EE@Base 1.8.0
+#MISSING: 1.8.1+ds-3# (arch=!armel !riscv64)_ZTVSt23_Sp_counted_ptr_inplaceIN3NMR6CSliceESaIS1_ELN9__gnu_cxx12_Lock_policyE2EE@Base 1.8.0
+ _ZTVSt23_Sp_counted_ptr_inplaceIN3NMR7BEAMSETESaIS1_ELN9__gnu_cxx12_Lock_policyE1EE@Base 1.8.0
+#MISSING: 1.8.1+ds-3# (arch=!armel !riscv64)_ZTVSt23_Sp_counted_ptr_inplaceIN3NMR7BEAMSETESaIS1_ELN9__gnu_cxx12_Lock_policyE2EE@Base 1.8.0
  (arch=!ia64 !powerpcspe)_ZZNSt19_Sp_make_shared_tag5_S_tiEvE5__tag@Base 1.8.0
  lib3mf_attachment_getpath@Base 1.8.0+ds
  lib3mf_attachment_getpathutf8@Base 1.8.0+ds
dh_makeshlibs: failing due to earlier errors
	mv debian/.debhelper/generated/lib3mf1/triggers.new debian/.debhelper/generated/lib3mf1/triggers
	rm -f debian/lib3mf-dev/DEBIAN/shlibs
make: *** [debian/rules:9: binary-arch] Error 255

Tail of log for libtango on armhf:

dpkg-buildpackage: info: host architecture armhf
 fakeroot debian/rules clean
QUILT_PATCHES=debian/patches \
	quilt --quiltrc /dev/null pop -a -R || test $? = 2
No patch removed
rm -rf .pc debian/stamp-patched
dh_testdir
dh_testroot
rm -rf stamps objs
find build -type d -name "objs-*" | xargs rm -rf
rm -f build-stamp-*
dh_clean
dh_clean: Compatibility levels before 9 are deprecated (level 7 in use)
 debian/rules build-arch
make: *** No rule to make target 'build-arch'.  Stop.

Tail of log for libsis-jhdf5-java on armhf:

[Utils]   Directory test-output/junitreports exists: true
[Utils] Attempting to create test-output/junitreports/TEST-ch.systemsx.cisd.hdf5.HDF5TimeDurationReaderTest.xml
[Utils]   Directory test-output/junitreports exists: true
[Utils] Attempting to create test-output/junitreports/TEST-ch.systemsx.cisd.hdf5.h5ar.DirectoryIndexUpdaterTest.xml
[Utils]   Directory test-output/junitreports exists: true
[Utils] Attempting to create test-output/junitreports/TEST-ch.systemsx.cisd.hdf5.h5ar.ArchivingStrategyTest.xml
[Utils]   Directory test-output/junitreports exists: true
[Utils] Attempting to create test-output/junitreports/TEST-ch.systemsx.cisd.hdf5.MatrixUtilsTest.xml
[Utils]   Directory test-output/junitreports exists: true
[Utils] Attempting to create test-output/junitreports/TEST-ch.systemsx.cisd.hdf5.HDF5RoundtripTest.xml
[Utils]   Directory test-output/junitreports exists: true
[TestNG] Time taken by org.testng.reporters.JUnitReportReporter@1d9bc04: 1558 ms
make[1]: *** [debian/rules:53: override_dh_auto_test] Error 1
make[1]: Leaving directory '/<<PKGBUILDDIR>>'
make: *** [debian/rules:16: build-arch] Error 2

Tail of log for mariadb-connector-odbc on armhf:

/usr/bin/cmake -E cmake_link_script CMakeFiles/cmTC_16fa4.dir/link.txt --verbose=1
/usr/bin/cc -g -O2 -fdebug-prefix-map=/<<PKGBUILDDIR>>=. -fstack-protector-strong -Wformat -Werror=format-security -I/usr/include/mariadb -Wdate-time -D_FORTIFY_SOURCE=2 -DCHECK_FUNCTION_EXISTS=floor  -Wl,-z,relro  -rdynamic CMakeFiles/cmTC_16fa4.dir/CheckFunctionExists.c.o  -o cmTC_16fa4 
/usr/bin/ld: CMakeFiles/cmTC_16fa4.dir/CheckFunctionExists.c.o: in function `main':
/usr/share/cmake-3.13/Modules/CheckFunctionExists.c:17: undefined reference to `floor'
collect2: error: ld returned 1 exit status
make[3]: *** [CMakeFiles/cmTC_16fa4.dir/build.make:87: cmTC_16fa4] Error 1
make[3]: Leaving directory '/<<PKGBUILDDIR>>/obj-arm-linux-gnueabihf/CMakeFiles/CMakeTmp'
make[2]: *** [Makefile:121: cmTC_16fa4/fast] Error 2
make[2]: Leaving directory '/<<PKGBUILDDIR>>/obj-arm-linux-gnueabihf/CMakeFiles/CMakeTmp'


dh_auto_configure: cd obj-arm-linux-gnueabihf && cmake -DCMAKE_INSTALL_PREFIX=/usr -DCMAKE_BUILD_TYPE=None -DCMAKE_INSTALL_SYSCONFDIR=/etc -DCMAKE_INSTALL_LOCALSTATEDIR=/var -DCMAKE_EXPORT_NO_PACKAGE_REGISTRY=ON -DCMAKE_FIND_PACKAGE_NO_PACKAGE_REGISTRY=ON -DCMAKE_INSTALL_RUNSTATEDIR=/run "-GUnix Makefiles" -DCMAKE_VERBOSE_MAKEFILE=ON -DCMAKE_INSTALL_LIBDIR=lib/arm-linux-gnueabihf -DMARIADB_LINK_DYNAMIC=yes -DINSTALL_LIB_SUFFIX=lib/arm-linux-gnueabihf/odbc .. returned exit code 1
make[1]: *** [debian/rules:11: override_dh_auto_configure] Error 255
make[1]: Leaving directory '/<<PKGBUILDDIR>>'
make: *** [debian/rules:8: build-arch] Error 2

Tail of log for libxsmm on armhf:

      |   ^~~~~
In file included from include/libxsmm.h:65,
                 from ./src/libxsmm_gemm_diff.h:34,
                 from ./src/libxsmm_main.c:31:
./src/libxsmm_main.c: In function 'libxsmm_init':
include/libxsmm_sync.h:70:29: warning: implicit declaration of function '__builtin_ia32_pause'; did you mean '__builtin_isspace'? [-Wimplicit-function-declaration]
   70 | # define LIBXSMM_SYNC_PAUSE __builtin_ia32_pause()
      |                             ^~~~~~~~~~~~~~~~~~~~
./src/libxsmm_main.c:719:36: note: in expansion of macro 'LIBXSMM_SYNC_PAUSE'
  719 |       if (0 != once) break; else { LIBXSMM_SYNC_PAUSE; }
      |                                    ^~~~~~~~~~~~~~~~~~
make[1]: *** [Makefile:721: build/intel64/libxsmm_main.o] Error 1
make[1]: Leaving directory '/<<PKGBUILDDIR>>'
dh_auto_build: make -j1 returned exit code 2
make: *** [debian/rules:7: build-arch] Error 255

Tail of log for mpqc3 on armhf:

          # error "Libint2 library is too old"
          #endif
          int main(int argc, char** argv) {
            libint2::detail::CoreEvalScratch<libint2::GaussianGmEval<double, -1>> scr(5);
            // FmEval_Chebyshev7 is added in 3c5c2d87e47d59dc1b63a9162d26f4006c070f12
            libint2::FmEval_Chebyshev7<double> cheb_boys_eval(12,1e-15);
            // libint2::finalize defined in 06be4d68a7b0da073469c40ccf49acb9ed62a18e
            libint2::finalize();
            return 0;
          }
      
dh_auto_configure: cd obj-arm-linux-gnueabihf && cmake -DCMAKE_INSTALL_PREFIX=/usr -DCMAKE_BUILD_TYPE=None -DCMAKE_INSTALL_SYSCONFDIR=/etc -DCMAKE_INSTALL_LOCALSTATEDIR=/var -DCMAKE_EXPORT_NO_PACKAGE_REGISTRY=ON -DCMAKE_FIND_PACKAGE_NO_PACKAGE_REGISTRY=ON "-GUnix Makefiles" -DCMAKE_VERBOSE_MAKEFILE=ON -DCMAKE_INSTALL_LIBDIR=lib/arm-linux-gnueabihf -DMPI_C_COMPILER=mpicc -DMPQC_NEW_FEATURES=1 -DBOOST=/usr .. returned exit code 1
make[1]: *** [debian/rules:21: override_dh_auto_configure] Error 255
make[1]: Leaving directory '/<<PKGBUILDDIR>>'
make: *** [debian/rules:18: build-arch] Error 2

Tail of log for msrtool on armhf:

gcc -g -O2 -fdebug-prefix-map=/<<PKGBUILDDIR>>=. -fstack-protector-strong -Wformat -Werror=format-security -Os -Wall -Werror   -c -o msrutils.o msrutils.c
gcc -g -O2 -fdebug-prefix-map=/<<PKGBUILDDIR>>=. -fstack-protector-strong -Wformat -Werror=format-security -Os -Wall -Werror   -c -o sys.o sys.c
sys.c: In function 'cpuid':
sys.c:40:2: error: unknown register name '%edx' in 'asm'
   40 |  asm ("cpuid" : "=b" (outebx) : "a" (0) : "%ecx", "%edx");
      |  ^~~
sys.c:40:2: error: unknown register name '%ecx' in 'asm'
sys.c:54:2: error: unknown register name '%edx' in 'asm'
   54 |  asm ("cpuid" : "=a" (outeax) : "a" (1) : "%ebx", "%ecx", "%edx");
      |  ^~~
sys.c:54:2: error: unknown register name '%ecx' in 'asm'
sys.c:54:2: error: unknown register name '%ebx' in 'asm'
make[1]: *** [<builtin>: sys.o] Error 1
make[1]: Leaving directory '/<<PKGBUILDDIR>>'
make: *** [/usr/share/cdbs/1/class/makefile.mk:77: debian/stamp-makefile-build] Error 2

Tail of log for mensis on armhf:

checking for remove... yes
checking for shmat... yes
checking for IceConnectionNumber in -lICE... yes
checking for XOpenDevice in -lXi... no
checking for XkbQueryExtension in -lxkbui... no
checking for pthread_create in -lpthread... yes
checking for u_strcpy in -lgdraw... yes
checking fontforge/basics.h usability... no
checking fontforge/basics.h presence... no
checking for fontforge/basics.h... no
You must install the include files for fontforge
before building mensis.
make[1]: *** [debian/rules:29: override_dh_auto_configure] Error 1
make[1]: Leaving directory '/<<PKGBUILDDIR>>'
make: *** [debian/rules:22: build-arch] Error 2

Tail of log for listaller on armhf:

  Command-line option `--thread` is deprecated and will be ignored

  Compilation failed: 7 error(s), 23 warning(s)



make[3]: *** [src/CMakeFiles/listaller-glib_precompile.dir/build.make:107: src/CMakeFiles/listaller-glib_precompile.dir/precompile.stamp] Error 1
make[3]: Leaving directory '/<<PKGBUILDDIR>>/obj-arm-linux-gnueabihf'
make[2]: *** [CMakeFiles/Makefile2:264: src/CMakeFiles/listaller-glib_precompile.dir/all] Error 2
make[2]: Leaving directory '/<<PKGBUILDDIR>>/obj-arm-linux-gnueabihf'
make[1]: *** [Makefile:144: all] Error 2
make[1]: Leaving directory '/<<PKGBUILDDIR>>/obj-arm-linux-gnueabihf'
dh_auto_build: cd obj-arm-linux-gnueabihf && make -j1 returned exit code 2
make: *** [debian/rules:15: build-arch] Error 255

Tail of log for nsd3 on armhf:

#define FACILITY LOG_DAEMON
#define MAX_INTERFACES 8
#define TCP_TIMEOUT 120
#define ROOT_SERVER /**/
#define INET6 /**/
#define BIND8_STATS /**/
#define NDEBUG /**/
#define RATELIMIT /**/
#define HAVE_SSL /**/

configure: exit 1
dh_auto_configure: ./configure --build=arm-linux-gnueabihf --prefix=/usr --includedir=\${prefix}/include --mandir=\${prefix}/share/man --infodir=\${prefix}/share/info --sysconfdir=/etc --localstatedir=/var --disable-silent-rules --libexecdir=\${prefix}/lib/nsd3 --disable-maintainer-mode --disable-dependency-tracking --with-configdir=/etc/nsd3 --with-nsd_conf_file=/etc/nsd3/nsd.conf --with-pidfile=/var/run/nsd3/nsd.pid --with-dbfile=/var/lib/nsd3/nsd.db --with-zonesdir=/etc/nsd3 --with-difffile=/var/lib/nsd3/ixfr.db --with-xfrdfile=/var/lib/nsd3/xfrd.state --disable-largefile --enable-root-server --enable-mmap --enable-ratelimit returned exit code 1
make[1]: *** [debian/rules:32: override_dh_auto_configure] Error 255
make[1]: Leaving directory '/<<PKGBUILDDIR>>'
make: *** [debian/rules:26: build-arch] Error 2

Tail of log for neuron on armhf:

libtool: link: (cd ".libs" && rm -f "libocxt.so" && ln -s "libocxt.so.0.0.0" "libocxt.so")
libtool: link: ( cd ".libs" && rm -f "libocxt.la" && ln -s "../libocxt.la" "libocxt.la" )
make[6]: Leaving directory '/<<PKGBUILDDIR>>/src/oc'
make[5]: *** [Makefile:562: all] Error 2
make[5]: Leaving directory '/<<PKGBUILDDIR>>/src/oc'
make[4]: *** [Makefile:519: all-recursive] Error 1
make[4]: Leaving directory '/<<PKGBUILDDIR>>/src'
make[3]: *** [Makefile:656: all-recursive] Error 1
make[3]: Leaving directory '/<<PKGBUILDDIR>>'
make[2]: *** [Makefile:514: all] Error 2
make[2]: Leaving directory '/<<PKGBUILDDIR>>'
dh_auto_build: make -j4 returned exit code 2
make[1]: *** [debian/rules:32: override_dh_auto_build] Error 255
make[1]: Leaving directory '/<<PKGBUILDDIR>>'
make: *** [debian/rules:15: build-arch] Error 2

Tail of log for open-axiom on armhf:

/* confdefs.h */
#define PACKAGE_NAME "OpenAxiom"
#define PACKAGE_TARNAME "openaxiom"
#define PACKAGE_VERSION "1.5.0-2013-06-21"
#define PACKAGE_STRING "OpenAxiom 1.5.0-2013-06-21"
#define PACKAGE_BUGREPORT "open-axiom-bugs@lists.sf.net"
#define PACKAGE_URL ""
#define PACKAGE "openaxiom"
#define VERSION "1.5.0-2013-06-21"
#define OPENAXIOM_BASE_RTS Runtime::sbcl

configure: exit 1
dh_auto_configure: cd build-tree && ../configure --build=arm-linux-gnueabihf --prefix=/usr --includedir=\${prefix}/include --mandir=\${prefix}/share/man --infodir=\${prefix}/share/info --sysconfdir=/etc --localstatedir=/var --disable-silent-rules --libexecdir=\${prefix}/lib/open-axiom --disable-maintainer-mode --disable-dependency-tracking --with-lisp=sbcl --with-x --disable-gcl returned exit code 1
make: *** [debian/rules:50: configure-stamp] Error 255

Tail of log for openmpi1.6 on armhf:

atomic-asm.S:107: Error: selected processor does not support `ldrexd r4,r5,[r0]' in ARM mode
atomic-asm.S:112: Error: selected processor does not support `strexd r1,r6,r7,[r0]' in ARM mode
atomic-asm.S:115: Error: selected processor does not support `dmb' in ARM mode
atomic-asm.S:130: Error: selected processor does not support `ldrexd r4,r5,[r0]' in ARM mode
atomic-asm.S:135: Error: selected processor does not support `dmb' in ARM mode
atomic-asm.S:136: Error: selected processor does not support `strexd r1,r6,r7,[r0]' in ARM mode
make[3]: *** [Makefile:1345: atomic-asm.lo] Error 1
make[3]: *** Waiting for unfinished jobs....
make[3]: Leaving directory '/<<PKGBUILDDIR>>/opal/asm'
make[2]: *** [Makefile:2084: all-recursive] Error 1
make[2]: Leaving directory '/<<PKGBUILDDIR>>/opal'
make[1]: *** [Makefile:1383: all-recursive] Error 1
make[1]: Leaving directory '/<<PKGBUILDDIR>>'
dh_auto_build: make -j4 returned exit code 2
make: *** [debian/rules:32: build-arch] Error 255

Tail of log for olive on armhf:

ui/viewerwidget.cpp:862:25: error: 'glEnd' was not declared in this scope
  862 |                         glEnd();
      |                         ^~~~~
ui/viewerwidget.cpp:897:17: error: 'glPopMatrix' was not declared in this scope
  897 |                 glPopMatrix();
      |                 ^~~~~~~~~~~
ui/viewerwidget.cpp:899:17: error: 'glColor4f' was not declared in this scope; did you mean 'glColorMask'?
  899 |                 glColor4f(color[0], color[1], color[2], color[3]);
      |                 ^~~~~~~~~
      |                 glColorMask
make[1]: *** [Makefile:1451: viewerwidget.o] Error 1
make[1]: *** Waiting for unfinished jobs....
make[1]: Leaving directory '/<<PKGBUILDDIR>>'
dh_auto_build: make -j4 returned exit code 2
make: *** [debian/rules:17: build-arch] Error 255

Tail of log for leela-zero on armhf:

/usr/include/c++/9/bits/atomic_base.h:419: undefined reference to `__atomic_load_8'
/usr/bin/ld: /usr/include/c++/9/bits/atomic_base.h:419: undefined reference to `__atomic_load_8'
/usr/bin/ld: /usr/include/c++/9/bits/atomic_base.h:419: undefined reference to `__atomic_load_8'
/usr/bin/ld: /usr/include/c++/9/bits/atomic_base.h:419: undefined reference to `__atomic_load_8'
/usr/bin/ld: /usr/include/c++/9/bits/atomic_base.h:419: undefined reference to `__atomic_load_8'
/usr/bin/ld: CMakeFiles/objs.dir/src/UCTNodePointer.cpp.o:/usr/include/c++/9/bits/atomic_base.h:419: more undefined references to `__atomic_load_8' follow
collect2: error: ld returned 1 exit status
make[3]: *** [CMakeFiles/tests.dir/build.make:159: tests] Error 1
make[3]: Leaving directory '/<<PKGBUILDDIR>>/obj-arm-linux-gnueabihf'
make[2]: *** [CMakeFiles/Makefile2:115: CMakeFiles/tests.dir/all] Error 2
make[2]: Leaving directory '/<<PKGBUILDDIR>>/obj-arm-linux-gnueabihf'
make[1]: *** [Makefile:155: all] Error 2
make[1]: Leaving directory '/<<PKGBUILDDIR>>/obj-arm-linux-gnueabihf'
dh_auto_build: cd obj-arm-linux-gnueabihf && make -j4 "INSTALL=install --strip-program=true" returned exit code 2
make: *** [debian/rules:15: build-arch] Error 255

Tail of log for olive-editor on armhf:

/<<PKGBUILDDIR>>/effects/internal/shakeeffect.cpp: In member function 'virtual void ShakeEffect::process_coords(double, GLTextureCoords&, int)':
/<<PKGBUILDDIR>>/effects/internal/shakeeffect.cpp:91:3: error: 'glRotatef' was not declared in this scope
   91 |   glRotatef(rotoff, 0, 0, 1);
      |   ^~~~~~~~~
[ 39%] Building CXX object CMakeFiles/olive-editor.dir/effects/internal/timecodeeffect.cpp.o
/usr/bin/c++  -DGITHASH=\"\" -DQT_CORE_LIB -DQT_DEPRECATED_WARNINGS -DQT_GUI_LIB -DQT_MULTIMEDIA_LIB -DQT_NETWORK_LIB -DQT_NO_DEBUG -DQT_OPENGL_LIB -DQT_SVG_LIB -DQT_WIDGETS_LIB -I/<<PKGBUILDDIR>>/obj-arm-linux-gnueabihf -I/<<PKGBUILDDIR>> -I/<<PKGBUILDDIR>>/obj-arm-linux-gnueabihf/olive-editor_autogen/include -isystem /usr/include/arm-linux-gnueabihf/qt5 -isystem /usr/include/arm-linux-gnueabihf/qt5/QtCore -isystem /usr/lib/arm-linux-gnueabihf/qt5/mkspecs/linux-g++ -isystem /usr/include/arm-linux-gnueabihf/qt5/QtGui -isystem /usr/include/arm-linux-gnueabihf/qt5/QtWidgets -isystem /usr/include/arm-linux-gnueabihf/qt5/QtMultimedia -isystem /usr/include/arm-linux-gnueabihf/qt5/QtNetwork -isystem /usr/include/arm-linux-gnueabihf/qt5/QtOpenGL -isystem /usr/include/arm-linux-gnueabihf/qt5/QtSvg -isystem /usr/include/arm-linux-gnueabihf  -g -O2 -fdebug-prefix-map=/<<PKGBUILDDIR>>=. -fstack-protector-strong -Wformat -Werror=format-security -Wdate-time -D_FORTIFY_SOURCE=2   -fPIC -std=c++11 -o CMakeFiles/olive-editor.dir/effects/internal/timecodeeffect.cpp.o -c /<<PKGBUILDDIR>>/effects/internal/timecodeeffect.cpp
make[3]: *** [CMakeFiles/olive-editor.dir/build.make:677: CMakeFiles/olive-editor.dir/effects/internal/shakeeffect.cpp.o] Error 1
make[3]: *** Waiting for unfinished jobs....
make[3]: Leaving directory '/<<PKGBUILDDIR>>/obj-arm-linux-gnueabihf'
make[2]: *** [CMakeFiles/Makefile2:76: CMakeFiles/olive-editor.dir/all] Error 2
make[2]: Leaving directory '/<<PKGBUILDDIR>>/obj-arm-linux-gnueabihf'
make[1]: *** [Makefile:133: all] Error 2
make[1]: Leaving directory '/<<PKGBUILDDIR>>/obj-arm-linux-gnueabihf'
dh_auto_build: cd obj-arm-linux-gnueabihf && make -j4 "INSTALL=install --strip-program=true" returned exit code 2
make: *** [debian/rules:17: build-arch] Error 255

Tail of log for rust-quick-xml on armhf:

    |         ^^^^ second mutable borrow occurs here
208 |     }
    |     - first borrow ends here

error: aborting due to previous error

For more information about this error, try `rustc --explain E0499`.
error: Could not compile `quick-xml`.

Caused by:
  process didn't exit successfully: `CARGO_PKG_AUTHORS='Johann Tuffe <tafia973@gmail.com>' CARGO_MANIFEST_DIR=/<<PKGBUILDDIR>> CARGO_PKG_HOMEPAGE= CARGO_PKG_NAME=quick-xml CARGO_PKG_VERSION_MINOR=17 LD_LIBRARY_PATH='/<<PKGBUILDDIR>>/target/debug/deps:/usr/lib' CARGO_PKG_VERSION=0.17.0 CARGO_PRIMARY_PACKAGE=1 CARGO_PKG_DESCRIPTION='High performance xml reader and writer' CARGO=/usr/bin/cargo CARGO_PKG_VERSION_PRE= CARGO_PKG_REPOSITORY='https://github.com/tafia/quick-xml' CARGO_PKG_VERSION_PATCH=0 CARGO_PKG_VERSION_MAJOR=0 rustc --crate-name quick_xml src/lib.rs --color never --emit=dep-info,metadata,link -C debuginfo=2 --test --cfg 'feature="default"' -C metadata=a77cbb25935f996c -C extra-filename=-a77cbb25935f996c --out-dir /<<PKGBUILDDIR>>/target/arm-unknown-linux-gnueabihf/debug/deps --target arm-unknown-linux-gnueabihf -C incremental=/<<PKGBUILDDIR>>/target/arm-unknown-linux-gnueabihf/debug/incremental -L dependency=/<<PKGBUILDDIR>>/target/arm-unknown-linux-gnueabihf/debug/deps -L dependency=/<<PKGBUILDDIR>>/target/debug/deps --extern memchr=/<<PKGBUILDDIR>>/target/arm-unknown-linux-gnueabihf/debug/deps/libmemchr-778e2d242a160e67.rlib -C debuginfo=2 --cap-lints warn -C linker=arm-linux-gnueabihf-gcc -C link-arg=-Wl,-z,relro --remap-path-prefix /<<PKGBUILDDIR>>=/usr/share/cargo/registry/quick-xml-0.17.0` (exit code: 1)
dh_auto_test: /usr/share/cargo/bin/cargo test --all returned exit code 101
make[1]: *** [debian/rules:6: override_dh_auto_test] Error 255
make[1]: Leaving directory '/<<PKGBUILDDIR>>'
make: *** [debian/rules:3: build-arch] Error 2

Tail of log for percona-xtradb-cluster-galera-2.x on armhf:

Checking for C library rt... yes
Checking for C header file sys/epoll.h... yes
Checking for C header file byteswap.h... yes
Checking for C header file endian.h... yes
Checking for C++ header file boost/shared_ptr.hpp... yes
Checking for C++ header file tr1/unordered_map... yes
Checking for C++ library boost_program_options... yes
Checking for __sync_fetch_and_add_8() in C library atomic... yes
Checking for C++ header file asio.hpp... yes
Checking for C++ header file asio/ssl.hpp... no
ssl support required but asio/ssl.hpp not found or not usable
compile with ssl=0 or check that openssl devel headers are usable
make[1]: *** [debian/rules:15: override_dh_auto_build] Error 1
make[1]: Leaving directory '/<<PKGBUILDDIR>>'
make: *** [debian/rules:18: build-arch] Error 2

Tail of log for perftest on armhf:

                 from src/perftest_communication.h:45,
                 from src/perftest_communication.c:17:
src/get_clock.h:109:2: warning: #warning get_cycles not implemented for this architecture: attempt asm/timex.h [-Wcpp]
  109 | #warning get_cycles not implemented for this architecture: attempt asm/timex.h
      |  ^~~~~~~
src/get_clock.h:110:10: fatal error: asm/timex.h: No such file or directory
  110 | #include <asm/timex.h>
      |          ^~~~~~~~~~~~~
compilation terminated.
make[2]: *** [Makefile:844: src/perftest_communication.o] Error 1
make[2]: Leaving directory '/<<BUILDDIR>>/perftest-4.4+0.5'
make[1]: *** [Makefile:571: all] Error 2
make[1]: Leaving directory '/<<BUILDDIR>>/perftest-4.4+0.5'
dh_auto_build: make -j4 returned exit code 2
make: *** [debian/rules:7: build-arch] Error 255

Tail of log for osrm on armhf:

/usr/bin/cmake -E cmake_link_script CMakeFiles/OSRM.dir/link.txt --verbose=1
/usr/bin/gcc-ar qc libOSRM.a  CMakeFiles/OSRM.dir/library/osrm_impl.cpp.o CMakeFiles/OSRM.dir/descriptors/description_factory.cpp.o CMakeFiles/OSRM.dir/data_structures/route_parameters.cpp.o CMakeFiles/OSRM.dir/data_structures/search_engine_data.cpp.o CMakeFiles/OSRM.dir/util/bearing.cpp.o CMakeFiles/OSRM.dir/algorithms/douglas_peucker.cpp.o CMakeFiles/OSRM.dir/algorithms/polyline_compressor.cpp.o CMakeFiles/OSRM.dir/algorithms/polyline_formatter.cpp.o CMakeFiles/OSRM.dir/server/http/reply.cpp.o CMakeFiles/ANGLE.dir/util/compute_angle.cpp.o CMakeFiles/COORDINATE.dir/data_structures/coordinate.cpp.o CMakeFiles/COORDINATE.dir/data_structures/coordinate_calculation.cpp.o CMakeFiles/GITDESCRIPTION.dir/util/git_sha.cpp.o CMakeFiles/FINGERPRINT.dir/util/fingerprint.cpp.o CMakeFiles/LOGGER.dir/util/simple_logger.cpp.o CMakeFiles/PHANTOMNODE.dir/data_structures/phantom_node.cpp.o CMakeFiles/EXCEPTION.dir/util/osrm_exception.cpp.o CMakeFiles/MERCATOR.dir/util/mercator.cpp.o CMakeFiles/IMPORT.dir/data_structures/external_memory_node.cpp.o CMakeFiles/IMPORT.dir/data_structures/import_edge.cpp.o
/usr/bin/gcc-ranlib libOSRM.a
make[3]: Leaving directory '/<<PKGBUILDDIR>>/obj-arm-linux-gnueabihf'
[ 70%] Built target OSRM
[ 71%] Linking CXX executable osrm-prepare
/usr/bin/cmake -E cmake_link_script CMakeFiles/osrm-prepare.dir/link.txt --verbose=1
/usr/bin/c++  -g -O2 -fdebug-prefix-map=/<<PKGBUILDDIR>>=. -fstack-protector-strong -Wformat -Werror=format-security -Wdate-time -D_FORTIFY_SOURCE=2 -flto -Wall -pedantic -fPIC -fdiagnostics-color=auto -std=c++11  -fopenmp -O3 -DNDEBUG  -Wl,-z,relro -rdynamic CMakeFiles/osrm-prepare.dir/prepare.cpp.o CMakeFiles/osrm-prepare.dir/contractor/contractor_options.cpp.o CMakeFiles/osrm-prepare.dir/contractor/edge_based_graph_factory.cpp.o CMakeFiles/osrm-prepare.dir/contractor/geometry_compressor.cpp.o CMakeFiles/osrm-prepare.dir/contractor/processing_chain.cpp.o CMakeFiles/osrm-prepare.dir/data_structures/hilbert_value.cpp.o CMakeFiles/ANGLE.dir/util/compute_angle.cpp.o CMakeFiles/FINGERPRINT.dir/util/fingerprint.cpp.o CMakeFiles/GITDESCRIPTION.dir/util/git_sha.cpp.o CMakeFiles/COORDINATE.dir/data_structures/coordinate.cpp.o CMakeFiles/COORDINATE.dir/data_structures/coordinate_calculation.cpp.o CMakeFiles/IMPORT.dir/data_structures/external_memory_node.cpp.o CMakeFiles/IMPORT.dir/data_structures/import_edge.cpp.o CMakeFiles/LOGGER.dir/util/simple_logger.cpp.o CMakeFiles/RESTRICTION.dir/data_structures/restriction_map.cpp.o CMakeFiles/EXCEPTION.dir/util/osrm_exception.cpp.o CMakeFiles/MERCATOR.dir/util/mercator.cpp.o  -o osrm-prepare -lrt -lboost_date_time -lboost_filesystem -lboost_iostreams -lboost_program_options -lboost_regex -lboost_system -lboost_thread -lpthread -lboost_unit_test_framework -lboost_chrono -lboost_atomic -lpthread -ltbb -ltbbmalloc -lluabind -llua5.2 -lstxxl -Wl,-Bstatic -losmpbf -Wl,-Bdynamic -lprotobuf -lboost_unit_test_framework -lboost_chrono -lboost_atomic -ltbb -ltbbmalloc -lluabind -llua5.2 -lstxxl -Wl,-Bstatic -losmpbf -Wl,-Bdynamic -lprotobuf 
make[3]: Leaving directory '/<<PKGBUILDDIR>>/obj-arm-linux-gnueabihf'
[ 71%] Built target osrm-prepare
make[2]: Leaving directory '/<<PKGBUILDDIR>>/obj-arm-linux-gnueabihf'
make[1]: *** [Makefile:133: all] Error 2
make[1]: Leaving directory '/<<PKGBUILDDIR>>/obj-arm-linux-gnueabihf'
dh_auto_build: cd obj-arm-linux-gnueabihf && make -j4 returned exit code 2
make: *** [debian/rules:6: build-arch] Error 255

Tail of log for qtjsbackend-opensource-src on armhf:

../3rdparty/v8/src/objects.h:7486:36: error: left operand of shift expression '(-8 << 26)' is negative [-fpermissive]
 7486 |       (~kMaxCachedArrayIndexLength << kArrayIndexHashLengthShift) |
      |       ~~~~~~~~~~~~~~~~~~~~~~~~~~~~~^~~~~~~~~~~~~~~~~~~~~~~~~~~~~~
make[3]: *** [Makefile:914: .obj/accessors.o] Error 1
make[3]: *** Waiting for unfinished jobs....
make[3]: *** [Makefile:1352: .obj/ast.o] Error 1
make[3]: *** [Makefile:1234: .obj/assembler.o] Error 1
make[3]: *** [Makefile:1087: .obj/api.o] Error 1
make[3]: Leaving directory '/<<PKGBUILDDIR>>/src/v8'
make[2]: *** [Makefile:91: sub-v8-make_first-ordered] Error 2
make[2]: Leaving directory '/<<PKGBUILDDIR>>/src'
make[1]: *** [Makefile:48: sub-src-make_first] Error 2
make[1]: Leaving directory '/<<PKGBUILDDIR>>'
dh_auto_build: make -j4 returned exit code 2
make: *** [debian/rules:14: build-arch] Error 255

Tail of log for qutecsound on armhf:

      |                                    ~~~~~~~~^~~~~~~~~
src/documentpage.cpp: In member function 'void DocumentPage::stopPanelSlot(int)':
src/documentpage.cpp:1080:38: warning: unused parameter 'index' [-Wunused-parameter]
 1080 | void DocumentPage::stopPanelSlot(int index)
      |                                  ~~~~^~~~~
src/documentpage.cpp: In member function 'void DocumentPage::setPanelSyncSlot(int, int)':
src/documentpage.cpp:1097:41: warning: unused parameter 'index' [-Wunused-parameter]
 1097 | void DocumentPage::setPanelSyncSlot(int index, int mode)
      |                                     ~~~~^~~~~
src/documentpage.cpp:1097:52: warning: unused parameter 'mode' [-Wunused-parameter]
 1097 | void DocumentPage::setPanelSyncSlot(int index, int mode)
      |                                                ~~~~^~~~
make[1]: *** [Makefile:827: build/doubles/release/obj/documentpage.o] Error 1
make[1]: Leaving directory '/<<PKGBUILDDIR>>'
make: *** [/usr/share/cdbs/1/class/makefile.mk:77: debian/stamp-makefile-build] Error 2

Tail of log for prboom on armhf:

      |                                png_error_ptr
i_sshot.c:234:32: note: each undeclared identifier is reported only once for each function it appears in
i_sshot.c:282:43: error: 'png_infopp_NULL' undeclared (first use in this function); did you mean 'png_infopp'?
  282 |       png_destroy_write_struct(&png_ptr,  png_infopp_NULL);
      |                                           ^~~~~~~~~~~~~~~
      |                                           png_infopp
make[4]: *** [Makefile:242: i_sshot.o] Error 1
make[4]: Leaving directory '/<<BUILDDIR>>/prboom-2.5.0+dfsg1/src/SDL'
make[3]: *** [Makefile:460: all-recursive] Error 1
make[3]: Leaving directory '/<<BUILDDIR>>/prboom-2.5.0+dfsg1/src'
make[2]: *** [Makefile:285: all-recursive] Error 1
make[2]: Leaving directory '/<<BUILDDIR>>/prboom-2.5.0+dfsg1'
make[1]: *** [Makefile:205: all] Error 2
make[1]: Leaving directory '/<<BUILDDIR>>/prboom-2.5.0+dfsg1'
make: *** [debian/rules:28: build-stamp] Error 2

Tail of log for qwinff on armhf:

      |     ^~~~~~~
src/qmpwidget/qmpwidget.cpp:166:5: error: 'glTexCoord2f' was not declared in this scope
  166 |     glTexCoord2f(0, 0); glVertex2f(-1, -1);
      |     ^~~~~~~~~~~~
src/qmpwidget/qmpwidget.cpp:166:25: error: 'glVertex2f' was not declared in this scope; did you mean 'glVertexAttrib2f'?
  166 |     glTexCoord2f(0, 0); glVertex2f(-1, -1);
      |                         ^~~~~~~~~~
      |                         glVertexAttrib2f
src/qmpwidget/qmpwidget.cpp:170:5: error: 'glEnd' was not declared in this scope
  170 |     glEnd();
      |     ^~~~~
make[1]: *** [Makefile:1145: qmpwidget.o] Error 1
make[1]: Leaving directory '/<<BUILDDIR>>/qwinff-0.2.1+git20191128'
dh_auto_build: make -j4 "INSTALL=install --strip-program=true" returned exit code 2
make: *** [debian/rules:18: build-arch] Error 255

Tail of log for rpm2html on armhf:

  758 |              headerNextIterator(sIter, &tag, &type, (void *) &p, &count);) {
      |              ^~~~~~~~~~~~~~~~~~
      |              headerInitIterator
rpmopen.c: In function 'rpmOpen':
rpmopen.c:1052:20: error: storage size of 'lead' isn't known
 1052 |     struct rpmlead lead;
      |                    ^~~~
rpmopen.c:1140:9: warning: implicit declaration of function 'fdClose'; did you mean 'fclose'? [-Wimplicit-function-declaration]
 1140 |         fdClose(fd);
      |         ^~~~~~~
      |         fclose
make[1]: *** [Makefile:514: rpmopen.o] Error 1
make[1]: Leaving directory '/<<PKGBUILDDIR>>'
dh_auto_build: make -j1 returned exit code 2
make: *** [debian/rules:7: build-arch] Error 255

Tail of log for ruby-strptime on armhf:

       string doesn't match
     # ./spec/strptime_spec.rb:32:in `exec'
     # ./spec/strptime_spec.rb:32:in `block (2 levels) in <top (required)>'

Finished in 0.0746 seconds (files took 0.96328 seconds to load)
42 examples, 1 failure

Failed examples:

rspec ./spec/strptime_spec.rb:25 # Strptime parses %y

/usr/bin/ruby2.5 /usr/bin/rspec --pattern ./spec/\*\*/\*_spec.rb failed
ERROR: Test "ruby2.5" failed. Exiting.
dh_auto_install: dh_ruby --install /<<PKGBUILDDIR>>/debian/ruby-strptime returned exit code 1
make: *** [debian/rules:6: binary-arch] Error 255

Tail of log for rust-mach-o-sys on armhf:

    |
581 | pub const BIND_SPECIAL_DYLIB_FLAT_LOOKUP: ::std::os::raw::c_char = -2;
    |                                                                    ^^ cannot apply unary operator `-`
    |
    = note: unsigned values cannot be negated

error: aborting due to 130 previous errors

For more information about this error, try `rustc --explain E0600`.
error: Could not compile `mach_o_sys`.

Caused by:
  process didn't exit successfully: `CARGO=/usr/bin/cargo CARGO_PKG_VERSION_PATCH=1 CARGO_PKG_HOMEPAGE= LD_LIBRARY_PATH='/<<PKGBUILDDIR>>/target/debug/deps:/usr/lib' CARGO_PRIMARY_PACKAGE=1 CARGO_MANIFEST_DIR=/<<PKGBUILDDIR>> CARGO_PKG_VERSION_MINOR=1 CARGO_PKG_VERSION=0.1.1 CARGO_PKG_DESCRIPTION='Bindings to the OSX mach-o system library' CARGO_PKG_VERSION_MAJOR=0 CARGO_PKG_AUTHORS='Nick Fitzgerald <fitzgen@gmail.com>' CARGO_PKG_VERSION_PRE= CARGO_PKG_NAME=mach_o_sys CARGO_PKG_REPOSITORY='https://github.com/fitzgen/mach_o_sys' rustc --crate-name mach_o_sys src/lib.rs --color never --crate-type lib --emit=dep-info,metadata,link -C debuginfo=2 -C metadata=0c4c15e6040ee28f -C extra-filename=-0c4c15e6040ee28f --out-dir /<<PKGBUILDDIR>>/target/arm-unknown-linux-gnueabihf/debug/deps --target arm-unknown-linux-gnueabihf -C incremental=/<<PKGBUILDDIR>>/target/arm-unknown-linux-gnueabihf/debug/incremental -L dependency=/<<PKGBUILDDIR>>/target/arm-unknown-linux-gnueabihf/debug/deps -L dependency=/<<PKGBUILDDIR>>/target/debug/deps -C debuginfo=2 --cap-lints warn -C linker=arm-linux-gnueabihf-gcc -C link-arg=-Wl,-z,relro --remap-path-prefix /<<PKGBUILDDIR>>=/usr/share/cargo/registry/mach-o-sys-0.1.1` (exit code: 1)
dh_auto_test: /usr/share/cargo/bin/cargo build returned exit code 101
make: *** [debian/rules:3: build-arch] Error 255

Tail of log for rust-kvm-ioctls on armhf:

    |                                                     ^^^^^^^^^^ types differ in mutability
    |
    = note: expected type `&mut [u8]`
               found type `&[u8]`

error: aborting due to 151 previous errors

Some errors occurred: E0308, E0412, E0422, E0425, E0432.
For more information about an error, try `rustc --explain E0308`.
error: Could not compile `kvm-ioctls`.

Caused by:
  process didn't exit successfully: `CARGO_PKG_VERSION_MINOR=2 CARGO_PKG_AUTHORS='Amazon Firecracker Team <firecracker-maintainers@amazon.com>' CARGO_PKG_NAME=kvm-ioctls CARGO_PRIMARY_PACKAGE=1 LD_LIBRARY_PATH='/<<PKGBUILDDIR>>/target/debug/deps:/usr/lib' CARGO=/usr/bin/cargo CARGO_PKG_VERSION_PATCH=0 CARGO_PKG_REPOSITORY='https://github.com/rust-vmm/kvm-ioctls' CARGO_PKG_DESCRIPTION='Safe wrappers over KVM ioctls' CARGO_PKG_HOMEPAGE= CARGO_MANIFEST_DIR=/<<PKGBUILDDIR>> CARGO_PKG_VERSION=0.2.0 CARGO_PKG_VERSION_MAJOR=0 CARGO_PKG_VERSION_PRE= rustc --crate-name kvm_ioctls src/lib.rs --color never --crate-type lib --emit=dep-info,metadata,link -C debuginfo=2 -C metadata=bcc30479d24b090d -C extra-filename=-bcc30479d24b090d --out-dir /<<PKGBUILDDIR>>/target/arm-unknown-linux-gnueabihf/debug/deps --target arm-unknown-linux-gnueabihf -C incremental=/<<PKGBUILDDIR>>/target/arm-unknown-linux-gnueabihf/debug/incremental -L dependency=/<<PKGBUILDDIR>>/target/arm-unknown-linux-gnueabihf/debug/deps -L dependency=/<<PKGBUILDDIR>>/target/debug/deps --extern kvm_bindings=/<<PKGBUILDDIR>>/target/arm-unknown-linux-gnueabihf/debug/deps/libkvm_bindings-6a4326da90e6e8b4.rlib --extern libc=/<<PKGBUILDDIR>>/target/arm-unknown-linux-gnueabihf/debug/deps/liblibc-9bdf6ed6996d8862.rlib -C debuginfo=2 --cap-lints warn -C linker=arm-linux-gnueabihf-gcc -C link-arg=-Wl,-z,relro --remap-path-prefix /<<PKGBUILDDIR>>=/usr/share/cargo/registry/kvm-ioctls-0.2.0` (exit code: 1)
dh_auto_test: /usr/share/cargo/bin/cargo build returned exit code 101
make: *** [debian/rules:3: build-arch] Error 255

Tail of log for qtox on armhf:

/usr/bin/c++  -DENABLE_SYSTRAY_GTK_BACKEND=1 -DENABLE_SYSTRAY_STATUSNOTIFIER_BACKEND=1 -DGIT_DESCRIBE=\"v1.16.3-2-debian\" -DGIT_VERSION="\"build without git\"" -DLOG_TO_FILE=1 -DQTOX_PLATFORM_EXT -DQT_CORE_LIB -DQT_GUI_LIB -DQT_MESSAGELOGCONTEXT=1 -DQT_NETWORK_LIB -DQT_NO_DEBUG -DQT_OPENGL_LIB -DQT_SVG_LIB -DQT_WIDGETS_LIB -DQT_XML_LIB -DTIMESTAMP="(disabled)" -I/<<PKGBUILDDIR>>/obj-arm-linux-gnueabihf/qtox_autogen/include -I/<<PKGBUILDDIR>>/obj-arm-linux-gnueabihf -I/<<PKGBUILDDIR>> -I/usr/include/arm-linux-gnueabihf -I/usr/include/libexif -I/usr/include/sqlcipher -I/usr/include/opus -I/usr/include/AL -I/usr/include/gdk-pixbuf-2.0 -I/usr/include/libmount -I/usr/include/blkid -I/usr/include/glib-2.0 -I/usr/lib/arm-linux-gnueabihf/glib-2.0/include -I/usr/include/gtk-2.0 -I/usr/lib/arm-linux-gnueabihf/gtk-2.0/include -I/usr/include/pango-1.0 -I/usr/include/atk-1.0 -I/usr/include/cairo -I/usr/include/pixman-1 -I/usr/include/harfbuzz -I/usr/include/fribidi -I/usr/include/uuid -I/usr/include/freetype2 -I/usr/include/libpng16 -isystem /usr/include/arm-linux-gnueabihf/qt5 -isystem /usr/include/arm-linux-gnueabihf/qt5/QtCore -isystem /usr/lib/arm-linux-gnueabihf/qt5/mkspecs/linux-g++ -isystem /usr/include/arm-linux-gnueabihf/qt5/QtGui -isystem /usr/include/arm-linux-gnueabihf/qt5/QtNetwork -isystem /usr/include/arm-linux-gnueabihf/qt5/QtOpenGL -isystem /usr/include/arm-linux-gnueabihf/qt5/QtWidgets -isystem /usr/include/arm-linux-gnueabihf/qt5/QtSvg -isystem /usr/include/arm-linux-gnueabihf/qt5/QtXml  -g -O2 -fdebug-prefix-map=/<<PKGBUILDDIR>>=. -fstack-protector-strong -Wformat -Werror=format-security -Wall -pedantic -Wdate-time -D_FORTIFY_SOURCE=2 -std=c++11 -fno-exceptions -fno-rtti -Wstrict-overflow -Wstrict-aliasing -fstack-protector-all -Wstack-protector -pthread -pthread   -fPIC -std=gnu++11 -o CMakeFiles/qtox.dir/qtox_autogen/mocs_compilation.cpp.o -c /<<PKGBUILDDIR>>/obj-arm-linux-gnueabihf/qtox_autogen/mocs_compilation.cpp
[ 85%] Linking CXX executable qtox
/usr/bin/cmake -E cmake_link_script CMakeFiles/qtox.dir/link.txt --verbose=1
/usr/bin/c++  -g -O2 -fdebug-prefix-map=/<<PKGBUILDDIR>>=. -fstack-protector-strong -Wformat -Werror=format-security -Wall -pedantic -Wdate-time -D_FORTIFY_SOURCE=2 -std=c++11 -fno-exceptions -fno-rtti -Wstrict-overflow -Wstrict-aliasing -fstack-protector-all -Wstack-protector -pthread -pthread  -Wl,-z,relro -Wl,-z,now -Wl,--as-needed -Wl,-z,now -Wl,-z,relro -rdynamic CMakeFiles/qtox.dir/qrc_res.cpp.o CMakeFiles/qtox.dir/qrc_translations.cpp.o CMakeFiles/qtox.dir/qrc_emojione.cpp.o CMakeFiles/qtox.dir/qrc_smileys.cpp.o CMakeFiles/qtox.dir/src/main.cpp.o CMakeFiles/qtox.dir/qtox_autogen/mocs_compilation.cpp.o  -o qtox libqtox_static.a /usr/lib/arm-linux-gnueabihf/libQt5Network.so.5.12.5 /usr/lib/arm-linux-gnueabihf/libQt5OpenGL.so.5.12.5 /usr/lib/arm-linux-gnueabihf/libQt5Svg.so.5.12.5 /usr/lib/arm-linux-gnueabihf/libQt5Widgets.so.5.12.5 /usr/lib/arm-linux-gnueabihf/libQt5Xml.so.5.12.5 -lavcodec -lavdevice -lavformat -lavutil -lexif -lqrencode -lsodium -lswscale -lsqlcipher -lvpx -lm -ltoxcore -lopenal -lX11 -lXss -lgdk_pixbuf-2.0 -lgobject-2.0 -lglib-2.0 -lglib-2.0 -lgtk-x11-2.0 -lgdk-x11-2.0 -lpangocairo-1.0 -latk-1.0 -lcairo -lgdk_pixbuf-2.0 -lgio-2.0 -lpangoft2-1.0 -lpango-1.0 -lgobject-2.0 -lglib-2.0 -lfontconfig -lfreetype /usr/lib/arm-linux-gnueabihf/libQt5Gui.so.5.12.5 /usr/lib/arm-linux-gnueabihf/libQt5Core.so.5.12.5 -lgdk_pixbuf-2.0 -lgtk-x11-2.0 -lgdk-x11-2.0 -lpangocairo-1.0 -latk-1.0 -lcairo -lgio-2.0 -lpangoft2-1.0 -lpango-1.0 -lfontconfig -lfreetype 
/usr/bin/ld: libqtox_static.a(camerasource.cpp.o): undefined reference to symbol '__atomic_fetch_add_8@@LIBATOMIC_1.0'
/usr/bin/ld: /usr/lib/arm-linux-gnueabihf/libatomic.so.1: error adding symbols: DSO missing from command line
collect2: error: ld returned 1 exit status
make[3]: *** [CMakeFiles/qtox.dir/build.make:3267: qtox] Error 1
make[3]: Leaving directory '/<<PKGBUILDDIR>>/obj-arm-linux-gnueabihf'
make[2]: *** [CMakeFiles/Makefile2:266: CMakeFiles/qtox.dir/all] Error 2
make[2]: Leaving directory '/<<PKGBUILDDIR>>/obj-arm-linux-gnueabihf'
make[1]: *** [Makefile:144: all] Error 2
make[1]: Leaving directory '/<<PKGBUILDDIR>>/obj-arm-linux-gnueabihf'
dh_auto_build: cd obj-arm-linux-gnueabihf && make -j4 "INSTALL=install --strip-program=true" returned exit code 2
make: *** [debian/rules:17: build-arch] Error 255

Tail of log for ruby2.1 on armhf:

make[4]: Leaving directory '/<<PKGBUILDDIR>>/ext/pathname'
gcc -I. -I../../../.ext/include/arm-linux-gnueabihf -I../../.././include -I../../.././ext/dl/callback -I../../.././ext/dl/callback/.. -DRUBY_EXTCONF_H=\"extconf.h\" -Wdate-time -D_FORTIFY_SOURCE=2 -D_FILE_OFFSET_BITS=64  -fPIC -g -O2 -fdebug-prefix-map=/<<PKGBUILDDIR>>=. -fstack-protector-strong -Wformat -Werror=format-security -fPIC  -o callback-8.o -c callback-8.c
rm -f ../../.ext/arm-linux-gnueabihf/nkf.so
gcc -shared -o ../../.ext/arm-linux-gnueabihf/nkf.so nkf.o -L. -L../.. -L. -Wl,-z,relro -L/<<PKGBUILDDIR>>/debian/lib -fstack-protector -rdynamic -Wl,-export-dynamic    -lruby-2.1  -lpthread -lgmp -ldl -lcrypt -lm   -lc
make[4]: Leaving directory '/<<PKGBUILDDIR>>/ext/nkf'
rm -f ../../../.ext/arm-linux-gnueabihf/dl/callback.so
gcc -shared -o ../../../.ext/arm-linux-gnueabihf/dl/callback.so callback.o callback-0.o callback-1.o callback-2.o callback-3.o callback-4.o callback-5.o callback-6.o callback-7.o callback-8.o -L. -L../../.. -L. -Wl,-z,relro -L/<<PKGBUILDDIR>>/debian/lib -fstack-protector -rdynamic -Wl,-export-dynamic    -lruby-2.1  -lpthread -lgmp -ldl -lcrypt -lm   -lc
make[4]: Leaving directory '/<<PKGBUILDDIR>>/ext/dl/callback'
make[3]: Leaving directory '/<<PKGBUILDDIR>>'
make[2]: *** [uncommon.mk:180: build-ext] Error 2
make[2]: Leaving directory '/<<PKGBUILDDIR>>'
dh_auto_build: make -j4 main V=1 returned exit code 2
make[1]: *** [debian/rules:67: override_dh_auto_build-arch] Error 255
make[1]: Leaving directory '/<<PKGBUILDDIR>>'
make: *** [debian/rules:49: build-arch] Error 2

Tail of log for r-cran-treespace on armhf:

make[1]: Entering directory '/<<BUILDDIR>>/r-cran-treespace-1.1.3.1+dfsg/src'
make[1]: Leaving directory '/<<BUILDDIR>>/r-cran-treespace-1.1.3.1+dfsg/src'
installing to /<<BUILDDIR>>/r-cran-treespace-1.1.3.1+dfsg/debian/r-cran-treespace/usr/lib/R/site-library/00LOCK-r-cran-treespace-1.1.3.1+dfsg/00new/treespace/libs
** R
** data
*** moving datasets to lazyload DB
** inst
** byte-compile and prepare package for lazy loading
terminate called after throwing an instance of 'std::runtime_error'
  what():  Mutex creation failed
Aborted (core dumped)
ERROR: lazy loading failed for package 'treespace'
* removing '/<<BUILDDIR>>/r-cran-treespace-1.1.3.1+dfsg/debian/r-cran-treespace/usr/lib/R/site-library/treespace'
dh_auto_install: R CMD INSTALL -l /<<BUILDDIR>>/r-cran-treespace-1.1.3.1\+dfsg/debian/r-cran-treespace/usr/lib/R/site-library --clean . "--built-timestamp='Mon, 08 Jul 2019 20:59:31 +0200'" returned exit code 1
make: *** [debian/rules:4: binary-arch] Error 255

Tail of log for rust-mysqlclient-sys on armhf:

    bindgen_test_layout_st_mysql_res
    bindgen_test_layout_st_mysql_rows
    bindgen_test_layout_st_mysql_stmt
    bindgen_test_layout_st_mysql_time
    bindgen_test_layout_st_net
    bindgen_test_layout_st_plugin_vio
    bindgen_test_layout_st_used_mem

test result: FAILED. 2 passed; 16 failed; 0 ignored; 0 measured; 0 filtered out

error: test failed, to rerun pass '--lib'
dh_auto_test: /usr/share/cargo/bin/cargo test --all returned exit code 101
make[1]: *** [debian/rules:6: override_dh_auto_test] Error 255
make[1]: Leaving directory '/<<PKGBUILDDIR>>'
make: *** [debian/rules:3: build-arch] Error 2

Tail of log for rust-pq-sys on armhf:

failures:
    bindgen_test_layout__PQconninfoOption
    bindgen_test_layout__PQprintOpt
    bindgen_test_layout___sFILE
    bindgen_test_layout___sbuf
    bindgen_test_layout_pgNotify
    bindgen_test_layout_pgresAttDesc

test result: FAILED. 2 passed; 6 failed; 0 ignored; 0 measured; 0 filtered out

error: test failed, to rerun pass '--lib'
dh_auto_test: /usr/share/cargo/bin/cargo test --all returned exit code 101
make[1]: *** [debian/rules:6: override_dh_auto_test] Error 255
make[1]: Leaving directory '/<<PKGBUILDDIR>>'
make: *** [debian/rules:3: build-arch] Error 2

Tail of log for rust-ucd-generate on armhf:

102 |                 wtr.dense_regex(args.name(), &re)?;
    |                     ^^^^^^^^^^^ the trait `regex_automata::StateID` is not implemented for `u64`

error: aborting due to 8 previous errors

Some errors occurred: E0277, E0599.
For more information about an error, try `rustc --explain E0277`.
error: Could not compile `ucd-generate`.

Caused by:
  process didn't exit successfully: `CARGO=/usr/bin/cargo CARGO_PKG_VERSION_MAJOR=0 CARGO_PKG_VERSION_PATCH=3 CARGO_PKG_VERSION=0.2.3 CARGO_PKG_VERSION_PRE= CARGO_PKG_DESCRIPTION='A program for generating packed representations of the Unicode character
database that can be efficiently searched.
' CARGO_PKG_HOMEPAGE='https://github.com/BurntSushi/ucd-generate' LD_LIBRARY_PATH='/<<PKGBUILDDIR>>/target/debug/deps:/usr/lib' CARGO_MANIFEST_DIR=/<<PKGBUILDDIR>> CARGO_PKG_NAME=ucd-generate CARGO_PKG_REPOSITORY='https://github.com/BurntSushi/ucd-generate' CARGO_PKG_AUTHORS='Andrew Gallant <jamslam@gmail.com>' CARGO_PKG_VERSION_MINOR=2 CARGO_PRIMARY_PACKAGE=1 rustc --crate-name ucd_generate src/main.rs --color never --crate-type bin --emit=dep-info,link -C debuginfo=2 -C metadata=df1186e76cf0d12f -C extra-filename=-df1186e76cf0d12f --out-dir /<<PKGBUILDDIR>>/target/arm-unknown-linux-gnueabihf/debug/deps --target arm-unknown-linux-gnueabihf -C incremental=/<<PKGBUILDDIR>>/target/arm-unknown-linux-gnueabihf/debug/incremental -L dependency=/<<PKGBUILDDIR>>/target/arm-unknown-linux-gnueabihf/debug/deps -L dependency=/<<PKGBUILDDIR>>/target/debug/deps --extern byteorder=/<<PKGBUILDDIR>>/target/arm-unknown-linux-gnueabihf/debug/deps/libbyteorder-e7117313fbbb7083.rlib --extern clap=/<<PKGBUILDDIR>>/target/arm-unknown-linux-gnueabihf/debug/deps/libclap-30f629d562305653.rlib --extern fst=/<<PKGBUILDDIR>>/target/arm-unknown-linux-gnueabihf/debug/deps/libfst-c91d752026f64ffd.rlib --extern regex_automata=/<<PKGBUILDDIR>>/target/arm-unknown-linux-gnueabihf/debug/deps/libregex_automata-dbcab6587b405209.rlib --extern ucd_parse=/<<PKGBUILDDIR>>/target/arm-unknown-linux-gnueabihf/debug/deps/libucd_parse-e605f5871d52697f.rlib --extern ucd_trie=/<<PKGBUILDDIR>>/target/arm-unknown-linux-gnueabihf/debug/deps/libucd_trie-359f132807196f55.rlib --extern ucd_util=/<<PKGBUILDDIR>>/target/arm-unknown-linux-gnueabihf/debug/deps/libucd_util-2be53ab2562265b1.rlib -C debuginfo=2 --cap-lints warn -C linker=arm-linux-gnueabihf-gcc -C link-arg=-Wl,-z,relro --remap-path-prefix /<<PKGBUILDDIR>>=/usr/share/cargo/registry/ucd-generate-0.2.3` (exit code: 1)
dh_auto_test: /usr/share/cargo/bin/cargo build returned exit code 101
make: *** [debian/rules:3: build-arch] Error 255

Tail of log for scanbuttond on armhf:

dpkg-buildpackage: info: source package scanbuttond
dpkg-buildpackage: info: source version 0.2.3.cvs20090713-16
dpkg-buildpackage: info: source distribution unstable
 dpkg-source --before-build .
dpkg-buildpackage: info: host architecture armhf
 fakeroot debian/rules clean
dh_testdir
set -e; for f in include/scanbuttond/config.h.in INSTALL; do cp "$f" "$f.upstream"; done
if [ -f /usr/share/libtool/config/ltmain.sh ]; then \
  cp /usr/share/libtool/config/ltmain.sh .; \
else \
  cp /usr/share/libtool/ltmain.sh .; \
fi
cp: cannot stat '/usr/share/libtool/ltmain.sh': No such file or directory
make: *** [debian/rules:45: configure-stamp] Error 1

Tail of log for tarantool on armhf:

      |    ^~~~~
/<<PKGBUILDDIR>>/third_party/coro/coro.c:480:14: error: 'NUM_SAVED' undeclared (first use in this function)
  480 |   ctx->sp -= NUM_SAVED;
      |              ^~~~~~~~~
/<<PKGBUILDDIR>>/third_party/coro/coro.c:480:14: note: each undeclared identifier is reported only once for each function it appears in
/<<PKGBUILDDIR>>/third_party/coro/coro.c:494:4: error: #error unsupported architecture
  494 |   #error unsupported architecture
      |    ^~~~~
make[3]: *** [CMakeFiles/coro.dir/build.make:66: CMakeFiles/coro.dir/third_party/coro/coro.c.o] Error 1
make[3]: Leaving directory '/<<PKGBUILDDIR>>/obj-arm-linux-gnueabihf'
make[2]: *** [CMakeFiles/Makefile2:352: CMakeFiles/coro.dir/all] Error 2
make[2]: Leaving directory '/<<PKGBUILDDIR>>/obj-arm-linux-gnueabihf'
make[1]: *** [Makefile:155: all] Error 2
make[1]: Leaving directory '/<<PKGBUILDDIR>>/obj-arm-linux-gnueabihf'
make: *** [/usr/share/cdbs/1/class/makefile.mk:77: debian/stamp-makefile-build] Error 2

Tail of log for slang-slirp on armhf:

checking for dlfcn.h... yes
checking for dlopen in -ldl... yes
checking for g++... g++
checking whether we are using the GNU C++ compiler... yes
checking whether g++ accepts -g... yes
checking for gfortran... gfortran
checking whether we are using the GNU Fortran compiler... yes
checking whether gfortran accepts -g... yes
checking how to get verbose linking output from gfortran... -v
checking for Fortran libraries of gfortran...  -L/usr/lib/gcc/arm-linux-gnueabihf/9 -L/usr/lib/gcc/arm-linux-gnueabihf/9/../../../arm-linux-gnueabihf -L/usr/lib/gcc/arm-linux-gnueabihf/9/../../.. -L/lib/arm-linux-gnueabihf -L/usr/lib/arm-linux-gnueabihf -lgfortran -lm
checking for dummy main to link with Fortran libraries... none
checking for Fortran name-mangling scheme... lower case, underscore, no extra underscore
checking for the slang library and header files ... no
configure: error: unable to find the slang library and header file slang.h
make: *** [/usr/share/cdbs/1/class/autotools.mk:46: debian/stamp-autotools] Error 1

Tail of log for traildb on armhf:

#define HAVE_INTTYPES_H 1
#define HAVE_STDINT_H 1
#define HAVE_UNISTD_H 1
#define HAVE_DLFCN_H 1
#define LT_OBJDIR ".libs/"
#define DSFMT_MEXP 521
#define HAVE_SSE2 1
#define HAVE_LIBJUDY 1
#define HAVE_JUDY_H 1
#define HAVE_ARCHIVE_H 1
#define HAVE_LIBARCHIVE 1

configure: exit 1
dh_auto_configure: ./configure --build=arm-linux-gnueabihf --prefix=/usr --includedir=\${prefix}/include --mandir=\${prefix}/share/man --infodir=\${prefix}/share/info --sysconfdir=/etc --localstatedir=/var --disable-silent-rules --libdir=\${prefix}/lib/arm-linux-gnueabihf --libexecdir=\${prefix}/lib/arm-linux-gnueabihf --disable-maintainer-mode --disable-dependency-tracking returned exit code 1
make: *** [debian/rules:10: build-arch] Error 255

Tail of log for tlsdate on armhf:

                 from /usr/include/openssl/bio.h:13,
                 from ./src/tlsdate-helper.h:37,
                 from src/tlsdate-helper.c:78:
/usr/include/openssl/ssl.h:1879:1: note: declared here
 1879 | DEPRECATEDIN_1_1_0(__owur const SSL_METHOD *TLSv1_client_method(void))
      | ^~~~~~~~~~~~~~~~~~
src/tlsdate-helper.c:1207:27: error: dereferencing pointer to incomplete type 'SSL' {aka 'struct ssl_st'}
 1207 |   memcpy(&result_time, ssl->s3->server_random, sizeof (uint32_t));
      |                           ^~
make[2]: *** [Makefile:2037: src/tlsdate_helper-tlsdate-helper.o] Error 1
make[2]: Leaving directory '/<<PKGBUILDDIR>>'
make[1]: *** [Makefile:1428: all] Error 2
make[1]: Leaving directory '/<<PKGBUILDDIR>>'
dh_auto_build: make -j1 returned exit code 2
make: *** [debian/rules:25: build-arch] Error 255

Tail of log for wham-align on armhf:

   25 | static score_mat obj_score_mat = { 1, 1, 1, 1 };
      |                  ^~~~~~~~~~~~~
In file included from main.cpp:38:
edit_distance.h: At global scope:
edit_distance.h:25:18: warning: 'obj_score_mat' defined but not used [-Wunused-variable]
   25 | static score_mat obj_score_mat = { 1, 1, 1, 1 };
      |                  ^~~~~~~~~~~~~
make[1]: *** [makefile:40: hash.o] Error 1
make[1]: *** Waiting for unfinished jobs....
make[1]: *** [makefile:37: embedhash.o] Error 1
make[1]: *** [makefile:46: main.o] Error 1
make[1]: *** [makefile:49: sequence.o] Error 1
make[1]: Leaving directory '/<<PKGBUILDDIR>>'
dh_auto_build: make -j4 "INSTALL=install --strip-program=true" returned exit code 2
make: *** [debian/rules:9: build-arch] Error 255

Tail of log for tendermint on armhf:

--- PASS: TestBadVotes (0.02s)
=== RUN   TestConflicts
--- PASS: TestConflicts (0.02s)
=== RUN   TestMakeCommit
--- PASS: TestMakeCommit (0.02s)
=== RUN   TestVoteSignable
--- PASS: TestVoteSignable (0.00s)
PASS
ok  	github.com/tendermint/tendermint/types	2.548s
?   	github.com/tendermint/tendermint/version	[no test files]
FAIL
dh_auto_test: cd obj-arm-linux-gnueabihf && go test -vet=off -v -p 1 github.com/tendermint/tendermint/benchmarks github.com/tendermint/tendermint/benchmarks/proto github.com/tendermint/tendermint/benchmarks/simu github.com/tendermint/tendermint/blockchain github.com/tendermint/tendermint/cmd/tendermint github.com/tendermint/tendermint/config/tendermint github.com/tendermint/tendermint/config/tendermint_test github.com/tendermint/tendermint/consensus github.com/tendermint/tendermint/fail-test github.com/tendermint/tendermint/mempool github.com/tendermint/tendermint/node github.com/tendermint/tendermint/proxy github.com/tendermint/tendermint/rpc/core github.com/tendermint/tendermint/rpc/core/types github.com/tendermint/tendermint/rpc/grpc github.com/tendermint/tendermint/rpc/test github.com/tendermint/tendermint/state github.com/tendermint/tendermint/test/app github.com/tendermint/tendermint/types github.com/tendermint/tendermint/version returned exit code 1
make[1]: *** [debian/rules:9: override_dh_auto_test] Error 255
make[1]: Leaving directory '/<<BUILDDIR>>/tendermint-0.8.0+git20170113.0.764091d'
make: *** [debian/rules:6: build-arch] Error 2

Tail of log for wmmail on armhf:

/usr/bin/make
make[1]: Entering directory '/<<PKGBUILDDIR>>'
Making all in src
make[2]: Entering directory '/<<PKGBUILDDIR>>/src'
gcc -DPACKAGE=\"WMMail\" -DVERSION=\"0.64\" -DHAVE_LIBNSL=1 -DHAVE_LIBX11=1 -DHAVE_LIBXEXT=1 -DHAVE_LIBXT=1 -DHAVE_LIBXPM=1 -DHAVE_LIBWUTIL=1 -DSTDC_HEADERS=1 -DHAVE_LIMITS_H=1 -DHAVE_STRINGS_H=1 -DHAVE_UNISTD_H=1 -DRETSIGTYPE=int -DHAVE_VPRINTF=1 -DHAVE_SOCKET=1 -DHAVE_STRSTR=1  -I. -I.      -g -O2 -I  -c global.c
In file included from global.c:27:
wmmail.h:32:10: fatal error: WINGs/proplist-compat.h: No such file or directory
   32 | #include <WINGs/proplist-compat.h>
      |          ^~~~~~~~~~~~~~~~~~~~~~~~~
compilation terminated.
make[2]: *** [Makefile:247: global.o] Error 1
make[2]: Leaving directory '/<<PKGBUILDDIR>>/src'
make[1]: *** [Makefile:125: all-recursive] Error 1
make[1]: Leaving directory '/<<PKGBUILDDIR>>'
make: *** [debian/rules:17: build-stamp] Error 2

Tail of log for wesnoth-1.8 on armhf:

	config/py-compile config.log
find po -name "*.gmo" -exec rm -f {} \;
find po -name "stamp-po" -exec rm -f {} \;
rm -f config.sub config.guess
/usr/bin/make -f /usr/share/quilt/quilt.make unpatch
make[1]: Entering directory '/<<PKGBUILDDIR>>'
QUILT_PATCHES=debian/patches \
	quilt --quiltrc /dev/null pop -a -R || test $? = 2
No patch removed
rm -rf .pc debian/stamp-patched
make[1]: Leaving directory '/<<PKGBUILDDIR>>'
dh_clean
dh_clean: Compatibility levels before 9 are deprecated (level 7 in use)
 debian/rules build-arch
make: *** No rule to make target 'build-arch'.  Stop.

Tail of log for xf86-video-msm on armhf:

                 from neon_memsets.c:30:
/usr/include/xorg/servermd.h:51:2: error: #error Drivers must include xorg-server.h before any other xserver headers
   51 | #error Drivers must include xorg-server.h before any other xserver headers
      |  ^~~~~
/usr/include/xorg/servermd.h:52:2: error: #error xserver code must include dix-config.h before any other headers
   52 | #error xserver code must include dix-config.h before any other headers
      |  ^~~~~
make[3]: *** [Makefile:550: neon_memsets.lo] Error 1
make[3]: Leaving directory '/<<BUILDDIR>>/xf86-video-msm-1.0.1+git20100122.5f7df591/src'
make[2]: *** [Makefile:426: all-recursive] Error 1
make[2]: Leaving directory '/<<BUILDDIR>>/xf86-video-msm-1.0.1+git20100122.5f7df591'
make[1]: *** [Makefile:358: all] Error 2
make[1]: Leaving directory '/<<BUILDDIR>>/xf86-video-msm-1.0.1+git20100122.5f7df591'
dh_auto_build: make -j1 returned exit code 2
make: *** [debian/rules:8: build-arch] Error 255

Tail of log for tulip on armhf:

      |     ^~~~~~
/<<PKGBUILDDIR>>/thirdparty/OGDF/include/ogdf/basic/DisjointSets.h:195:5: error: there are no arguments to 'memcpy' that depend on a template parameter, so a declaration of 'memcpy' must be available [-fpermissive]
  195 |     memcpy(this->siblings,siblings,sizeof(int)*this->maxNumberOfElements);
      |     ^~~~~~
make[4]: *** [thirdparty/OGDF/CMakeFiles/OGDF-tulip-4.8.dir/build.make:3108: thirdparty/OGDF/CMakeFiles/OGDF-tulip-4.8.dir/src/ogdf/basic/DisjointSets.cpp.o] Error 1
make[4]: *** Waiting for unfinished jobs....
make[4]: Leaving directory '/<<PKGBUILDDIR>>/obj-arm-linux-gnueabihf'
make[3]: *** [CMakeFiles/Makefile2:220: thirdparty/OGDF/CMakeFiles/OGDF-tulip-4.8.dir/all] Error 2
make[3]: Leaving directory '/<<PKGBUILDDIR>>/obj-arm-linux-gnueabihf'
make[2]: *** [Makefile:133: all] Error 2
make[2]: Leaving directory '/<<PKGBUILDDIR>>/obj-arm-linux-gnueabihf'
dh_auto_build: cd obj-arm-linux-gnueabihf && make -j4 returned exit code 2
make[1]: *** [debian/rules:13: override_dh_auto_build-arch] Error 255
make[1]: Leaving directory '/<<PKGBUILDDIR>>'
make: *** [debian/rules:7: build-arch] Error 2

Tail of log for iem-plugin-suite on armhf:

                 from ../../Source/../JuceLibraryCode/JuceHeader.h:17,
                 from ../../Source/PluginProcessor.h:25,
                 from ../../Source/PluginProcessor.cpp:23:
/usr/share/juce/modules/juce_core/memory/juce_ScopedPointer.h:56:38: note: declared here
   56 |     JUCE_DEPRECATED_ATTRIBUTE inline ~ScopedPointer()         { reset(); }
      |                                      ^
make[3]: *** [Makefile:166: build/intermediate/Release/PluginProcessor_a059e380.o] Error 1
make[3]: Leaving directory '/<<PKGBUILDDIR>>/SimpleDecoder/Builds/LinuxMakefile'
make[2]: *** [Makefile:119: SimpleDecoder-LinuxMakefile-build] Error 2
rm SimpleDecoder/Builds/LinuxMakefile/Makefile
make[2]: Leaving directory '/<<PKGBUILDDIR>>'
dh_auto_build: make -j1 "INSTALL=install --strip-program=true" returned exit code 2
make[1]: *** [debian/rules:42: override_dh_auto_build] Error 255
make[1]: Leaving directory '/<<PKGBUILDDIR>>'
make: *** [debian/rules:39: binary-arch] Error 2

Tail of log for aseba on armhf:

/usr/bin/ld: CMakeFiles/asebamarxbot.dir/EnkiMarxbot.cpp.o:(.data.rel.ro._ZTVN4Enki13MarxbotViewerE[_ZTVN4Enki13MarxbotViewerE]+0x110): undefined reference to `Enki::ViewerWidget::renderScene(double, double, double, double, double, double)'
/usr/bin/ld: CMakeFiles/asebamarxbot.dir/EnkiMarxbot.cpp.o:(.data.rel.ro._ZTVN4Enki13MarxbotViewerE[_ZTVN4Enki13MarxbotViewerE]+0x114): undefined reference to `Enki::ViewerWidget::picking(double, double, double, double, double, double)'
/usr/bin/ld: CMakeFiles/asebamarxbot.dir/EnkiMarxbot.cpp.o:(.data.rel.ro._ZTVN4Enki13MarxbotViewerE[_ZTVN4Enki13MarxbotViewerE]+0x118): undefined reference to `Enki::ViewerWidget::displayMessages()'
/usr/bin/ld: CMakeFiles/asebamarxbot.dir/EnkiMarxbot.cpp.o:(.data.rel.ro._ZTVN4Enki13MarxbotViewerE[_ZTVN4Enki13MarxbotViewerE]+0x11c): undefined reference to `Enki::ViewerWidget::displayWidgets()'
/usr/bin/ld: CMakeFiles/asebamarxbot.dir/EnkiMarxbot.cpp.o:(.data.rel.ro._ZTVN4Enki13MarxbotViewerE[_ZTVN4Enki13MarxbotViewerE]+0x120): undefined reference to `Enki::ViewerWidget::clickWidget(QMouseEvent*)'
/usr/bin/ld: CMakeFiles/asebamarxbot.dir/EnkiMarxbot.cpp.o:(.data.rel.ro._ZTVN4Enki13MarxbotViewerE[_ZTVN4Enki13MarxbotViewerE]+0x124): undefined reference to `Enki::ViewerWidget::helpActivated()'
collect2: error: ld returned 1 exit status
make[3]: *** [targets/enki-marxbot/CMakeFiles/asebamarxbot.dir/build.make:129: targets/enki-marxbot/asebamarxbot] Error 1
make[3]: Leaving directory '/<<PKGBUILDDIR>>/obj-arm-linux-gnueabihf'
make[2]: *** [CMakeFiles/Makefile2:1806: targets/enki-marxbot/CMakeFiles/asebamarxbot.dir/all] Error 2
make[2]: Leaving directory '/<<PKGBUILDDIR>>/obj-arm-linux-gnueabihf'
make[1]: *** [Makefile:144: all] Error 2
make[1]: Leaving directory '/<<PKGBUILDDIR>>/obj-arm-linux-gnueabihf'
dh_auto_build: cd obj-arm-linux-gnueabihf && make -j1 returned exit code 2
make: *** [debian/rules:14: build-arch] Error 255

Tail of log for octave-tisean on armhf:

***** ###############################################################
***** fail("lazy([(1:10);(1:10)],7,-0.06)");
***** fail("lazy((1:10),0,0.04)");
***** fail("[a,b,c] = lazy((1:10),1,0.05)");
***** test
 "In is generated from Octave using 'in = 1 + 0.5 * rand(10,1);'";
 in = [1.47007925526322;1.168775342017635;1.10943000146922; 1.174293926353764;  1.075741574572656; 1.373465364407417; 1.089417388489702; 1.403669883669071;1.452726826806777;  1.016960990335037];
 "res was generated using 'lazy -m1 -v0.06 in.dat' from TISEAN 'lazy'";
 res = [1.47007930, 0.00000000; 1.17153454, -2.75921822E-03; 1.10942996, 0.00000000; 1.17153454, 2.75933743E-03; 1.07574153, 0.00000000; 1.37346542, 0.00000000; 1.08941734, 0.00000000; 1.40366983, 0.00000000; 1.45272684, 0.00000000; 1.01696098, 0.00000000];
 [al,bl] = lazy(in, 1, -0.06);
 assert([al,bl],res,1e-6);
4 tests, 4 passed, 0 known failure, 0 skipped
Summary: 162 tests, 150 passed, 0 known failures, 0 skipped
Some tests failed.  Giving up...
make: *** [debian/rules:5: binary-arch] Error 1

Tail of log for ardour3 on armhf:

19:27:51 runner ['/usr/bin/g++', '-I/<<PKGBUILDDIR>>', '-Wdate-time', '-D_FORTIFY_SOURCE=2', '-g', '-O2', '-fdebug-prefix-map=/<<PKGBUILDDIR>>=.', '-fstack-protector-strong', '-Wformat', '-Werror=format-security', '-DNDEBUG', '-fshow-column', '-DWAF_BUILD', '-O3', '-fomit-frame-pointer', '-ffast-math', '-fstrength-reduce', '-pipe', '-DLXVST_32BIT', '-Wall', '-Wpointer-arith', '-Wcast-qual', '-Wcast-align', '-DBOOST_SYSTEM_NO_DEPRECATED', '-D_ISOC9X_SOURCE', '-D_LARGEFILE64_SOURCE', '-D_FILE_OFFSET_BITS=64', '-DENABLE_NLS', '-Woverloaded-virtual', '-D__STDC_LIMIT_MACROS', '-D__STDC_FORMAT_MACROS', '-DHAVE_FFTW3', '-fPIC', '-fPIC', '-pthread', '-pthread', '-pthread', '-pthread', '-pthread', '-I/<<PKGBUILDDIR>>/build/libs/ardour', '-I/<<PKGBUILDDIR>>/libs/ardour', '-I/<<PKGBUILDDIR>>/build/libs/surfaces/control_protocol', '-I/<<PKGBUILDDIR>>/libs/surfaces/control_protocol', '-I/<<PKGBUILDDIR>>/build/libs', '-I/<<PKGBUILDDIR>>/libs', '-I/<<PKGBUILDDIR>>/build/libs/midi++2', '-I/<<PKGBUILDDIR>>/libs/midi++2', '-I/<<PKGBUILDDIR>>/build/libs/evoral', '-I/<<PKGBUILDDIR>>/libs/evoral', '-I/<<PKGBUILDDIR>>/build/libs/audiographer', '-I/<<PKGBUILDDIR>>/libs/audiographer', '-I/<<PKGBUILDDIR>>/build/libs/audiographer/src', '-I/<<PKGBUILDDIR>>/libs/audiographer/src', '-I/<<PKGBUILDDIR>>/build/libs/pbd', '-I/<<PKGBUILDDIR>>/libs/pbd', '-I/<<PKGBUILDDIR>>/build/libs/evoral/src/libsmf', '-I/<<PKGBUILDDIR>>/libs/evoral/src/libsmf', '-I/<<PKGBUILDDIR>>/build/libs/timecode', '-I/<<PKGBUILDDIR>>/libs/timecode', '-I/<<PKGBUILDDIR>>/build/libs/vamp-sdk', '-I/<<PKGBUILDDIR>>/libs/vamp-sdk', '-I/<<PKGBUILDDIR>>/build/libs/libltc/ltc', '-I/<<PKGBUILDDIR>>/libs/libltc/ltc', '-I/<<PKGBUILDDIR>>/build/libs/rubberband', '-I/<<PKGBUILDDIR>>/libs/rubberband', '-I/<<PKGBUILDDIR>>/build/libs/taglib', '-I/<<PKGBUILDDIR>>/libs/taglib', '-I/<<PKGBUILDDIR>>/build/libs/taglib/taglib', '-I/<<PKGBUILDDIR>>/libs/taglib/taglib', '-I/<<PKGBUILDDIR>>/build/libs/taglib/taglib/toolkit', '-I/<<PKGBUILDDIR>>/libs/taglib/taglib/toolkit', '-I/usr/include/glibmm-2.4', '-I/usr/lib/arm-linux-gnueabihf/glibmm-2.4/include', '-I/usr/include/glib-2.0', '-I/usr/lib/arm-linux-gnueabihf/glib-2.0/include', '-I/usr/include/sigc++-2.0', '-I/usr/lib/arm-linux-gnueabihf/sigc++-2.0/include', '-I/usr/include/libxml2', '-I/usr/include/uuid', '-I/usr/include/raptor2', '-I/usr/include/arm-linux-gnueabihf', '-I/usr/include/lilv-0', '-I/usr/include/sratom-0', '-I/usr/include/sord-0', '-I/usr/include/serd-0', '-I/usr/include/suil-0', '-I/usr/include/giomm-2.4', '-I/usr/lib/arm-linux-gnueabihf/giomm-2.4/include', '-I/usr/include/libmount', '-I/usr/include/blkid', '-I/<<PKGBUILDDIR>>/build', '-DINTERNAL_SHARED_LIBS=1', '-DHAVE_GLIB=1', '-DHAVE_GTHREAD=1', '-DHAVE_GLIBMM=1', '-DHAVE_SNDFILE=1', '-DHAVE_GIOMM=1', '-DHAVE_CURL=1', '-DHAVE_LO=1', '-DHAVE_DLOPEN=1', '-DENABLE_NLS=1', '-DLXVST_SUPPORT=1', '-DWINDOWS_KEY="Mod4><Super"', '-DIS_OSX=0', '-DCONFIG_ARCH="armv7l"', '-DHAVE_XML=1', '-DHAVE_SIGCPP=1', '-DHAVE_UUID=1', '-DHAVE_GETMNTENT=1', '-DHAVE_EXECINFO=1', '-DHAVE_POSIX_MEMALIGN=1', '-DHAVE_LIBS_PBD=1', '-DHAVE_LIBS_MIDIPP2=1', '-DHAVE_LIBS_EVORAL=1', '-DHAVE_FFTW3=1', '-DHAVE_FFTW3F=1', '-DHAVE_LIBS_VAMP_SDK=1', '-DHAVE_LIBS_QM_DSP=1', '-DHAVE_AUBIO=1', '-DHAVE_AUBIO4=1', '-DHAVE_LIBS_VAMP_PLUGINS=1', '-DHAVE_LIBS_TAGLIB=1', '-DHAVE_LIBS_LIBLTC=1', '-DHAVE_LIBS_RUBBERBAND=1', '-DHAVE_CONTROL_PROTOCOL=1', '-DHAVE_FRONTIER=1', '-DHAVE_GENERIC_MIDI=1', '-DHAVE_MACKIE=1', '-DHAVE_OSC=1', '-DHAVE_TRANZPORT=1', '-DHAVE_WIIMOTE=1', '-DHAVE_CWIID_H=1', '-DHAVE_BLUETOOTH_H=1', '-DHAVE_CWIID=1', '-DBUILD_WIIMOTE=1', '-DHAVE_LIBS_SURFACES=1', '-DHAVE_2IN2OUT=1', '-DHAVE_1IN2OUT=1', '-DHAVE_VBAP=1', '-DHAVE_STEREOBALANCE=1', '-DHAVE_LIBS_PANNERS=1', '-DHAVE_JACK=1', '-DHAVE_LIBS_BACKENDS=1', '-DHAVE_LIBS_TIMECODE=1', '-DHAVE_LRDF=1', '-DHAVE_SAMPLERATE=1', '-DHAVE_ALSA=1', '-DHAVE_LV2=1', '-DHAVE_NEW_LV2=1', '-DHAVE_SERD=1', '-DHAVE_SORD=1', '-DHAVE_SRATOM=1', '-DHAVE_LILV=1', '-DHAVE_NEW_LILV=1', '-DHAVE_SUIL=1', '-DLV2_SUPPORT=1', '-DHAVE_OGG=1', '-DHAVE_FLAC=1', '-DHAVE_RUBBERBAND=1', '-DUSE_RUBBERBAND=1', '-DCURRENT_SESSION_FILE_VERSION=3001', '-DHAVE_SYS_VFS_H=1', '-DHAVE_SYS_STATVFS_H=1', '-DHAVE_UNISTD=1', '-DHAVE_BOOST_SCOPED_PTR_HPP=1', '-DHAVE_BOOST_PTR_CONTAINER_PTR_LIST_HPP=1', '-DHAVE_LIBS_ARDOUR=1', '-DHAVE_GTKMM=1', '-DHAVE_GTK=1', '-DHAVE_LIBS_GTKMM2EXT=1', '-DHAVE_LIBS_CLEARLOOKS_NEWER=1', '-DHAVE_BOOST_FORMAT_HPP=1', '-DHAVE_LIBS_AUDIOGRAPHER=1', '-DHAVE_LV2_1_0_0=1', '-DHAVE_LIBS_PLUGINS_REASONABLESYNTH_LV2=1', '-DHAVE_GNOMECANVAS=1', '-DHAVE_GNOMECANVASMM=1', '-DHAVE_X11=1', '-DHAVE_FONTCONFIG=1', '-DHAVE_BOOST_SHARED_PTR_HPP=1', '-DHAVE_BOOST_WEAK_PTR_HPP=1', '-DHAVE_GTK2_ARDOUR=1', '-DHAVE_EXPORT=1', '-DHAVE_MIDI_MAPS=1', '-DHAVE_MCP=1', '-DHAVE_PATCHFILES=1', '-DHAVE_TOOLS_SANITY_CHECK=1', '-DPACKAGE="ardour3"', '-DDATA_DIR="/usr/share"', '-DCONFIG_DIR="/etc"', '-DLOCALEDIR="/usr/share/locale"', '-DPROGRAM_NAME="Ardour"', '-DEVORAL_MIDI_XML=1', '-DLXVST_SUPPORT', '../libs/ardour/auditioner.cc', '-c', '-o', 'libs/ardour/auditioner.cc.1.o']
In file included from ../libs/ardour/ardour/plugin.h:32,
                 from ../libs/ardour/auditioner.cc:32:
/<<PKGBUILDDIR>>/libs/ardour/ardour/cycles.h:219:2: warning: #warning You are compiling libardour on a platform for which ardour/cycles.h needs work [-Wcpp]
  219 | #warning You are compiling libardour on a platform for which ardour/cycles.h needs work
      |  ^~~~~~~
* Node /<<PKGBUILDDIR>>/build/gtk2_ardour/ardev_common_waf.sh is created by more than once (full message on 'waf -v -v'). The task generators are:
  1. 'ardev_common_waf.sh' in /<<PKGBUILDDIR>>/gtk2_ardour
  2. 'ardev_common_waf.sh' in /<<PKGBUILDDIR>>/gtk2_ardour
Waf: Leaving directory `/<<PKGBUILDDIR>>/build'
Build failed
 -> task in 'ardour' failed (exit status 1): 
	{task 3060241104L: cxx audioregion.cc -> audioregion.cc.1.o}
['/usr/bin/g++', '-I/<<PKGBUILDDIR>>', '-Wdate-time', '-D_FORTIFY_SOURCE=2', '-g', '-O2', '-fdebug-prefix-map=/<<PKGBUILDDIR>>=.', '-fstack-protector-strong', '-Wformat', '-Werror=format-security', '-DNDEBUG', '-fshow-column', '-DWAF_BUILD', '-O3', '-fomit-frame-pointer', '-ffast-math', '-fstrength-reduce', '-pipe', '-DLXVST_32BIT', '-Wall', '-Wpointer-arith', '-Wcast-qual', '-Wcast-align', '-DBOOST_SYSTEM_NO_DEPRECATED', '-D_ISOC9X_SOURCE', '-D_LARGEFILE64_SOURCE', '-D_FILE_OFFSET_BITS=64', '-DENABLE_NLS', '-Woverloaded-virtual', '-D__STDC_LIMIT_MACROS', '-D__STDC_FORMAT_MACROS', '-DHAVE_FFTW3', '-fPIC', '-fPIC', '-pthread', '-pthread', '-pthread', '-pthread', '-pthread', '-I/<<PKGBUILDDIR>>/build/libs/ardour', '-I/<<PKGBUILDDIR>>/libs/ardour', '-I/<<PKGBUILDDIR>>/build/libs/surfaces/control_protocol', '-I/<<PKGBUILDDIR>>/libs/surfaces/control_protocol', '-I/<<PKGBUILDDIR>>/build/libs', '-I/<<PKGBUILDDIR>>/libs', '-I/<<PKGBUILDDIR>>/build/libs/midi++2', '-I/<<PKGBUILDDIR>>/libs/midi++2', '-I/<<PKGBUILDDIR>>/build/libs/evoral', '-I/<<PKGBUILDDIR>>/libs/evoral', '-I/<<PKGBUILDDIR>>/build/libs/audiographer', '-I/<<PKGBUILDDIR>>/libs/audiographer', '-I/<<PKGBUILDDIR>>/build/libs/audiographer/src', '-I/<<PKGBUILDDIR>>/libs/audiographer/src', '-I/<<PKGBUILDDIR>>/build/libs/pbd', '-I/<<PKGBUILDDIR>>/libs/pbd', '-I/<<PKGBUILDDIR>>/build/libs/evoral/src/libsmf', '-I/<<PKGBUILDDIR>>/libs/evoral/src/libsmf', '-I/<<PKGBUILDDIR>>/build/libs/timecode', '-I/<<PKGBUILDDIR>>/libs/timecode', '-I/<<PKGBUILDDIR>>/build/libs/vamp-sdk', '-I/<<PKGBUILDDIR>>/libs/vamp-sdk', '-I/<<PKGBUILDDIR>>/build/libs/libltc/ltc', '-I/<<PKGBUILDDIR>>/libs/libltc/ltc', '-I/<<PKGBUILDDIR>>/build/libs/rubberband', '-I/<<PKGBUILDDIR>>/libs/rubberband', '-I/<<PKGBUILDDIR>>/build/libs/taglib', '-I/<<PKGBUILDDIR>>/libs/taglib', '-I/<<PKGBUILDDIR>>/build/libs/taglib/taglib', '-I/<<PKGBUILDDIR>>/libs/taglib/taglib', '-I/<<PKGBUILDDIR>>/build/libs/taglib/taglib/toolkit', '-I/<<PKGBUILDDIR>>/libs/taglib/taglib/toolkit', '-I/usr/include/glibmm-2.4', '-I/usr/lib/arm-linux-gnueabihf/glibmm-2.4/include', '-I/usr/include/glib-2.0', '-I/usr/lib/arm-linux-gnueabihf/glib-2.0/include', '-I/usr/include/sigc++-2.0', '-I/usr/lib/arm-linux-gnueabihf/sigc++-2.0/include', '-I/usr/include/libxml2', '-I/usr/include/uuid', '-I/usr/include/raptor2', '-I/usr/include/arm-linux-gnueabihf', '-I/usr/include/lilv-0', '-I/usr/include/sratom-0', '-I/usr/include/sord-0', '-I/usr/include/serd-0', '-I/usr/include/suil-0', '-I/usr/include/giomm-2.4', '-I/usr/lib/arm-linux-gnueabihf/giomm-2.4/include', '-I/usr/include/libmount', '-I/usr/include/blkid', '-I/<<PKGBUILDDIR>>/build', '-DINTERNAL_SHARED_LIBS=1', '-DHAVE_GLIB=1', '-DHAVE_GTHREAD=1', '-DHAVE_GLIBMM=1', '-DHAVE_SNDFILE=1', '-DHAVE_GIOMM=1', '-DHAVE_CURL=1', '-DHAVE_LO=1', '-DHAVE_DLOPEN=1', '-DENABLE_NLS=1', '-DLXVST_SUPPORT=1', '-DWINDOWS_KEY="Mod4><Super"', '-DIS_OSX=0', '-DCONFIG_ARCH="armv7l"', '-DHAVE_XML=1', '-DHAVE_SIGCPP=1', '-DHAVE_UUID=1', '-DHAVE_GETMNTENT=1', '-DHAVE_EXECINFO=1', '-DHAVE_POSIX_MEMALIGN=1', '-DHAVE_LIBS_PBD=1', '-DHAVE_LIBS_MIDIPP2=1', '-DHAVE_LIBS_EVORAL=1', '-DHAVE_FFTW3=1', '-DHAVE_FFTW3F=1', '-DHAVE_LIBS_VAMP_SDK=1', '-DHAVE_LIBS_QM_DSP=1', '-DHAVE_AUBIO=1', '-DHAVE_AUBIO4=1', '-DHAVE_LIBS_VAMP_PLUGINS=1', '-DHAVE_LIBS_TAGLIB=1', '-DHAVE_LIBS_LIBLTC=1', '-DHAVE_LIBS_RUBBERBAND=1', '-DHAVE_CONTROL_PROTOCOL=1', '-DHAVE_FRONTIER=1', '-DHAVE_GENERIC_MIDI=1', '-DHAVE_MACKIE=1', '-DHAVE_OSC=1', '-DHAVE_TRANZPORT=1', '-DHAVE_WIIMOTE=1', '-DHAVE_CWIID_H=1', '-DHAVE_BLUETOOTH_H=1', '-DHAVE_CWIID=1', '-DBUILD_WIIMOTE=1', '-DHAVE_LIBS_SURFACES=1', '-DHAVE_2IN2OUT=1', '-DHAVE_1IN2OUT=1', '-DHAVE_VBAP=1', '-DHAVE_STEREOBALANCE=1', '-DHAVE_LIBS_PANNERS=1', '-DHAVE_JACK=1', '-DHAVE_LIBS_BACKENDS=1', '-DHAVE_LIBS_TIMECODE=1', '-DHAVE_LRDF=1', '-DHAVE_SAMPLERATE=1', '-DHAVE_ALSA=1', '-DHAVE_LV2=1', '-DHAVE_NEW_LV2=1', '-DHAVE_SERD=1', '-DHAVE_SORD=1', '-DHAVE_SRATOM=1', '-DHAVE_LILV=1', '-DHAVE_NEW_LILV=1', '-DHAVE_SUIL=1', '-DLV2_SUPPORT=1', '-DHAVE_OGG=1', '-DHAVE_FLAC=1', '-DHAVE_RUBBERBAND=1', '-DUSE_RUBBERBAND=1', '-DCURRENT_SESSION_FILE_VERSION=3001', '-DHAVE_SYS_VFS_H=1', '-DHAVE_SYS_STATVFS_H=1', '-DHAVE_UNISTD=1', '-DHAVE_BOOST_SCOPED_PTR_HPP=1', '-DHAVE_BOOST_PTR_CONTAINER_PTR_LIST_HPP=1', '-DHAVE_LIBS_ARDOUR=1', '-DHAVE_GTKMM=1', '-DHAVE_GTK=1', '-DHAVE_LIBS_GTKMM2EXT=1', '-DHAVE_LIBS_CLEARLOOKS_NEWER=1', '-DHAVE_BOOST_FORMAT_HPP=1', '-DHAVE_LIBS_AUDIOGRAPHER=1', '-DHAVE_LV2_1_0_0=1', '-DHAVE_LIBS_PLUGINS_REASONABLESYNTH_LV2=1', '-DHAVE_GNOMECANVAS=1', '-DHAVE_GNOMECANVASMM=1', '-DHAVE_X11=1', '-DHAVE_FONTCONFIG=1', '-DHAVE_BOOST_SHARED_PTR_HPP=1', '-DHAVE_BOOST_WEAK_PTR_HPP=1', '-DHAVE_GTK2_ARDOUR=1', '-DHAVE_EXPORT=1', '-DHAVE_MIDI_MAPS=1', '-DHAVE_MCP=1', '-DHAVE_PATCHFILES=1', '-DHAVE_TOOLS_SANITY_CHECK=1', '-DPACKAGE="ardour3"', '-DDATA_DIR="/usr/share"', '-DCONFIG_DIR="/etc"', '-DLOCALEDIR="/usr/share/locale"', '-DPROGRAM_NAME="Ardour"', '-DEVORAL_MIDI_XML=1', '-DLXVST_SUPPORT', '../libs/ardour/audioregion.cc', '-c', '-o', 'libs/ardour/audioregion.cc.1.o']
make: *** [/usr/share/cdbs/1/class/makefile.mk:77: debian/stamp-makefile-build] Error 1

Tail of log for gffread on armhf:

dh_auto_build -- 'LINKER=$(CXX)'
	make -j4 "INSTALL=install --strip-program=true" LINKER=\$\(CXX\)
make[2]: Entering directory '/<<PKGBUILDDIR>>'
g++ -Wdate-time -D_FORTIFY_SOURCE=2 -Wall -Wextra -I. -I/usr/include/gclib -D_FILE_OFFSET_BITS=64 -D_LARGEFILE_SOURCE -D_REENTRANT -fno-strict-aliasing -std=c++0x -fno-exceptions -fno-rtti -Wno-class-memaccess -g -O2 -fdebug-prefix-map=/<<PKGBUILDDIR>>=. -fstack-protector-strong -Wformat -Werror=format-security -g -O0 -DDEBUG -D_DEBUG -DGDEBUG -c gffread.cpp -o gffread.o
g++ -Wdate-time -D_FORTIFY_SOURCE=2 -Wall -Wextra -I. -I/usr/include/gclib -D_FILE_OFFSET_BITS=64 -D_LARGEFILE_SOURCE -D_REENTRANT -fno-strict-aliasing -std=c++0x -fno-exceptions -fno-rtti -Wno-class-memaccess -g -O2 -fdebug-prefix-map=/<<PKGBUILDDIR>>=. -fstack-protector-strong -Wformat -Werror=format-security -g -O0 -DDEBUG -D_DEBUG -DGDEBUG -c gff_utils.cpp -o gff_utils.o
g++ -Wdate-time -D_FORTIFY_SOURCE=2 -Wl,-z,relro -Wl,-z,now -o gffread gffread.o gff_utils.o -lgclib  -pthread
/usr/bin/ld: gffread.o: in function `GLineReader::getLine(_IO_FILE*)':
/usr/include/gclib/GBase.h:576: undefined reference to `GLineReader::getLine(_IO_FILE*, long long&)'
collect2: error: ld returned 1 exit status
make[2]: *** [Makefile:87: gffread] Error 1
make[2]: Leaving directory '/<<PKGBUILDDIR>>'
dh_auto_build: make -j4 "INSTALL=install --strip-program=true" LINKER=\$\(CXX\) returned exit code 2
make[1]: *** [debian/rules:16: override_dh_auto_build] Error 255
make[1]: Leaving directory '/<<PKGBUILDDIR>>'
make: *** [debian/rules:13: build-arch] Error 2

Tail of log for vmemcache on armhf:

make[3]: Leaving directory '/<<PKGBUILDDIR>>/obj-arm-linux-gnueabihf'
make[2]: *** [CMakeFiles/Makefile2:525: tests/CMakeFiles/vmemcache_test_mt.dir/all] Error 2
[ 66%] Linking C executable vmemcache_test_basic
cd /<<PKGBUILDDIR>>/obj-arm-linux-gnueabihf/tests && /usr/bin/cmake -E cmake_link_script CMakeFiles/vmemcache_test_basic.dir/link.txt --verbose=1
/usr/bin/cc -g -O2 -fdebug-prefix-map=/<<PKGBUILDDIR>>=. -fstack-protector-strong -Wformat -Werror=format-security -Wall -pedantic -Wdate-time -D_FORTIFY_SOURCE=2 -fno-common -Wall -Wconversion -Wmissing-field-initializers -Wmissing-prototypes -Wpointer-arith -Wsign-compare -Wsign-conversion -Wunused-macros -Werror=incompatible-pointer-types -fdata-sections -ffunction-sections  -Wl,-z,relro -Wl,-z,now -latomic  -Wl,-z,relro -Wl,--warn-common -rdynamic CMakeFiles/vmemcache_test_basic.dir/vmemcache_test_basic.c.o  -o vmemcache_test_basic -Wl,-rpath,/<<PKGBUILDDIR>>/obj-arm-linux-gnueabihf/src ../src/libvmemcache.so.0 
/usr/bin/ld: ../src/libvmemcache.so.0: undefined reference to `__atomic_fetch_add_8'
collect2: error: ld returned 1 exit status
make[3]: *** [tests/CMakeFiles/vmemcache_test_basic.dir/build.make:88: tests/vmemcache_test_basic] Error 1
make[3]: Leaving directory '/<<PKGBUILDDIR>>/obj-arm-linux-gnueabihf'
make[2]: *** [CMakeFiles/Makefile2:562: tests/CMakeFiles/vmemcache_test_basic.dir/all] Error 2
make[2]: Leaving directory '/<<PKGBUILDDIR>>/obj-arm-linux-gnueabihf'
make[1]: *** [Makefile:144: all] Error 2
make[1]: Leaving directory '/<<PKGBUILDDIR>>/obj-arm-linux-gnueabihf'
dh_auto_build: cd obj-arm-linux-gnueabihf && make -j4 "INSTALL=install --strip-program=true" returned exit code 2
make: *** [debian/rules:10: build-arch] Error 255

Tail of log for unanimity on armhf:

      |     ~~~~~~~~~~~~~~~~~~~~~~~~~~~~~~~~
 1969 |     __comp);
      |     ~~~~~~~              
[ 49%] Linking CXX static library libunanimity.a
cd /<<BUILDDIR>>/unanimity-3.3.0+dfsg/build/src && /usr/bin/cmake -P CMakeFiles/unanimity.dir/cmake_clean_target.cmake
cd /<<BUILDDIR>>/unanimity-3.3.0+dfsg/build/src && /usr/bin/cmake -E cmake_link_script CMakeFiles/unanimity.dir/link.txt --verbose=1
/usr/bin/ar qc libunanimity.a  CMakeFiles/unanimity.dir/genomicconsensus/experimental/Consensus.cpp.o CMakeFiles/unanimity.dir/genomicconsensus/experimental/ConsensusModelFactory.cpp.o CMakeFiles/unanimity.dir/genomicconsensus/experimental/Filters.cpp.o CMakeFiles/unanimity.dir/genomicconsensus/experimental/GenomicConsensus.cpp.o CMakeFiles/unanimity.dir/genomicconsensus/experimental/IPoaModel.cpp.o CMakeFiles/unanimity.dir/genomicconsensus/experimental/Input.cpp.o CMakeFiles/unanimity.dir/genomicconsensus/experimental/Intervals.cpp.o CMakeFiles/unanimity.dir/genomicconsensus/experimental/Output.cpp.o CMakeFiles/unanimity.dir/genomicconsensus/experimental/Settings.cpp.o CMakeFiles/unanimity.dir/genomicconsensus/experimental/Sorting.cpp.o CMakeFiles/unanimity.dir/genomicconsensus/experimental/Workflow.cpp.o CMakeFiles/unanimity.dir/genomicconsensus/experimental/arrow/ArrowModel.cpp.o CMakeFiles/unanimity.dir/genomicconsensus/experimental/io/FastaWriter.cpp.o CMakeFiles/unanimity.dir/genomicconsensus/experimental/io/FastqWriter.cpp.o CMakeFiles/unanimity.dir/genomicconsensus/experimental/io/GffWriter.cpp.o CMakeFiles/unanimity.dir/genomicconsensus/experimental/io/VcfWriter.cpp.o CMakeFiles/unanimity.dir/genomicconsensus/experimental/plurality/PluralityModel.cpp.o CMakeFiles/unanimity.dir/genomicconsensus/experimental/poa/PoaModel.cpp.o CMakeFiles/unanimity.dir/ChemistryMapping.cpp.o CMakeFiles/unanimity.dir/ChemistryTriple.cpp.o CMakeFiles/unanimity.dir/Interval.cpp.o CMakeFiles/unanimity.dir/ReadId.cpp.o CMakeFiles/unanimity.dir/SparsePoa.cpp.o CMakeFiles/unanimity.dir/SubreadResultCounter.cpp.o CMakeFiles/unanimity.dir/Timer.cpp.o CMakeFiles/unanimity.dir/Utility.cpp.o CMakeFiles/unanimity.dir/ConsensusSettings.cpp.o
/usr/bin/ranlib libunanimity.a
make[3]: Leaving directory '/<<BUILDDIR>>/unanimity-3.3.0+dfsg/build'
[ 49%] Built target unanimity
make[2]: Leaving directory '/<<BUILDDIR>>/unanimity-3.3.0+dfsg/build'
make[1]: *** [Makefile:133: all] Error 2
make[1]: Leaving directory '/<<BUILDDIR>>/unanimity-3.3.0+dfsg/build'
dh_auto_build: cd build && make -j4 "INSTALL=install --strip-program=true" returned exit code 2
make: *** [debian/rules:28: build-arch] Error 255

Tail of log for cone on armhf:

myserverremoteconfig.C: In member function 'mail::account* myServer::remoteConfig::login2()':
myserverremoteconfig.C:145:11: error: cannot convert 'bool' to 'mail::account*' in return
  145 |    return false;
      |           ^~~~~
make[5]: *** [Makefile:849: myserverremoteconfig.o] Error 1
make[5]: Leaving directory '/<<PKGBUILDDIR>>/cone'
make[4]: *** [Makefile:970: all-recursive] Error 1
make[4]: Leaving directory '/<<PKGBUILDDIR>>/cone'
make[3]: *** [Makefile:617: all] Error 2
make[3]: Leaving directory '/<<PKGBUILDDIR>>/cone'
make[2]: *** [Makefile:370: all-recursive] Error 1
make[2]: Leaving directory '/<<PKGBUILDDIR>>'
make[1]: *** [Makefile:275: all] Error 2
make[1]: Leaving directory '/<<PKGBUILDDIR>>'
make: *** [/usr/share/cdbs/1/class/makefile.mk:77: debian/stamp-makefile-build] Error 2

Tail of log for haskell-genvalidity-hspec on armhf:

    [Int]
      +++ OK, passed 100 tests.
  shrinkValidDoesNotShrinkToItself
    Rational
      +++ OK, passed 100 tests.
    [Rational]
      +++ OK, passed 100 tests.

Finished in 16.3292 seconds
277 examples, 0 failures
Test suite genvalidity-hspec-test: PASS
Test suite logged to:
dist-ghc/test/genvalidity-hspec-0.6.2.3-genvalidity-hspec-test.log
1 of 2 test suites (1 of 2 test cases) passed.
make: *** [/usr/share/cdbs/1/class/hlibrary.mk:154: check-ghc-stamp] Error 1

Tail of log for valentina on armhf:

QWARN  : TST_ValentinaCommandLine::TestOpenCollection(0.7_Armhole_adjustment_0.10) QProcess: Destroyed while process ("/<<PKGBUILDDIR>>/src/test/CollectionTest/bin/../../../app/valentina/bin/valentina") is still running.
FAIL!  : TST_ValentinaCommandLine::TestOpenCollection(0.7_Armhole_adjustment_0.10) 'exit == exitCode' returned FALSE. (The finish operation timed out or an error occurred.
Program: /<<PKGBUILDDIR>>/src/test/CollectionTest/bin/../../../app/valentina/bin/valentina 
Arguments: /<<PKGBUILDDIR>>/src/test/CollectionTest/bin/tst_valentina_collection_tmp/0.7_Armhole_adjustment_0.10.val, --test.
QStandardPaths: XDG_RUNTIME_DIR not set, defaulting to '/tmp/runtime-buildd'
)
   Loc: [tst_valentinacommandline.cpp(296)]
PASS   : TST_ValentinaCommandLine::cleanupTestCase()
Totals: 37 passed, 7 failed, 0 skipped, 0 blacklisted, 2446756ms
********* Finished testing of TST_ValentinaCommandLine *********
make[2]: *** [Makefile:429: check] Error 7
make[2]: Leaving directory '/<<PKGBUILDDIR>>/src/test/CollectionTest'
make[1]: *** [debian/rules:34: override_dh_auto_test] Error 2
make[1]: Leaving directory '/<<PKGBUILDDIR>>'
make: *** [debian/rules:12: binary-arch] Error 2

Tail of log for pyfftw on armhf:

One run: 19.39 ms (versus 64.95 ms for singled threaded)
One run: 21.44 ms (versus 65.20 ms for singled threaded)
One run: 70.57 ms (versus 128.68 ms for numpy.fft)
One run: 70.62 ms (versus 128.59 ms for numpy.fft)
One run: 28.22 ms (versus 129.78 ms for numpy.fft)
One run: 28.82 ms (versus 129.52 ms for numpy.fft)
One run: 73.19 ms (versus 86.09 ms for numpy.fft)
One run: 71.27 ms (versus 81.29 ms for numpy.fft)
One run: 35.90 ms (versus 83.04 ms for numpy.fft)
One run: 36.19 ms (versus 83.00 ms for numpy.fft)
E: pybuild pybuild:341: test: plugin distutils failed with: exit code=1: cd /<<PKGBUILDDIR>>/.pybuild/cpython3_3.7_pyfftw/build; python3.7 -m unittest discover -v 
dh_auto_test: pybuild --test -i python{version} -p 3.7 returned exit code 13
make[1]: *** [debian/rules:35: override_dh_auto_test] Error 1
make[1]: Leaving directory '/<<PKGBUILDDIR>>'
make: *** [debian/rules:14: build-arch] Error 2

Tail of log for agda on armhf:

[304 of 357] Compiling Agda.TypeChecking.EtaExpand ( src/full/Agda/TypeChecking/EtaExpand.hs, dist-ghc/build/Agda/TypeChecking/EtaExpand.o )
[305 of 357] Compiling Agda.TypeChecking.Rewriting ( src/full/Agda/TypeChecking/Rewriting.hs, dist-ghc/build/Agda/TypeChecking/Rewriting.o )
[306 of 357] Compiling Agda.TypeChecking.Reduce.Fast ( src/full/Agda/TypeChecking/Reduce/Fast.hs, dist-ghc/build/Agda/TypeChecking/Reduce/Fast.o )
ghc: panic! (the 'impossible' happened)
  (GHC version 8.6.5 for arm-unknown-linux):
	tyThingCoAxiom
  Identifier ‘$fReadCompletionType8’
  Call stack:
      CallStack (from HasCallStack):
        callStackDoc, called at compiler/utils/Outputable.hs:1160:37 in ghc:Outputable
        pprPanic, called at compiler/main/HscTypes.hs:2170:32 in ghc:HscTypes

Please report this as a GHC bug:  http://www.haskell.org/ghc/reportabug

make: *** [/usr/share/cdbs/1/class/hlibrary.mk:147: build-ghc-stamp] Error 1

Dependency installability problem for orpie on armhf:

orpie build-depends on missing:
- libocamlgsl-ocaml-dev:armhf

Tail of log for rheolef on armhf:

/usr/bin/ld: ../plib/.libs/libfem.a(geo_domain_indirect_seq.o):(.data.rel.ro+0x18): multiple definition of `typeinfo for rheolef::geo_domain_indirect_rep<double, rheolef::sequential>'; ../plib/.libs/libfem.a(geo_domain_indirect.o):(.data.rel.ro+0x0): first defined here
/usr/bin/ld: ../plib/.libs/libfem.a(geo_domain_indirect_mpi.o):(.rodata+0x0): multiple definition of `typeinfo name for rheolef::geo_domain_indirect_rep<double, rheolef::distributed>'; ../plib/.libs/libfem.a(geo_domain_indirect.o):(.rodata+0x38): first defined here
/usr/bin/ld: ../plib/.libs/libfem.a(geo_domain_indirect_mpi.o):(.data.rel.ro+0x0): multiple definition of `typeinfo for rheolef::geo_domain_indirect_rep<double, rheolef::distributed>'; ../plib/.libs/libfem.a(geo_domain_indirect.o):(.data.rel.ro+0xc): first defined here
/usr/bin/ld: ../plib/.libs/libfem.a(geo_domain_seq.o):(.rodata+0x4): multiple definition of `typeinfo name for rheolef::geo_rep<double, rheolef::sequential>'; ../plib/.libs/libfem.a(geo.o):(.rodata+0x2c): first defined here
/usr/bin/ld: ../plib/.libs/libfem.a(geo_domain_seq.o):(.data.rel.ro+0x0): multiple definition of `typeinfo for rheolef::geo_rep<double, rheolef::sequential>'; ../plib/.libs/libfem.a(geo.o):(.data.rel.ro+0xc): first defined here
/usr/bin/ld: ../plib/.libs/libfem.a(geo_domain_mpi.o):(.rodata+0x4): multiple definition of `typeinfo name for rheolef::geo_rep<double, rheolef::distributed>'; ../plib/.libs/libfem.a(geo.o):(.rodata+0x84): first defined here
/usr/bin/ld: ../plib/.libs/libfem.a(geo_domain_mpi.o):(.data.rel.ro+0x0): multiple definition of `typeinfo for rheolef::geo_rep<double, rheolef::distributed>'; ../plib/.libs/libfem.a(geo.o):(.data.rel.ro+0x24): first defined here
collect2: error: ld returned 1 exit status
make[4]: *** [Makefile:628: librheolef.la] Error 1
make[3]: *** [Makefile:544: all] Error 2
make[2]: *** [Makefile:471: all-recursive] Error 1
make[1]: *** [Makefile:554: all-recursive] Error 1
make[1]: Leaving directory '/<<PKGBUILDDIR>>'
dh_auto_build: make -j1 returned exit code 2
make: *** [debian/rules:30: build-arch] Error 255

Tail of log for mrtrix3 on armhf:

/usr/include/c++/9/bits/stl_vector.h:1195:4: note: parameter passing for argument of type '__gnu_cxx::__normal_iterator<MR::App::Argument*, std::vector<MR::App::Argument, std::allocator<MR::App::Argument> > >' changed in GCC 7.1
 1195 |    _M_realloc_insert(end(), __x);
      |    ^~~~~~~~~~~~~~~~~
/usr/include/c++/9/bits/stl_vector.h: In function 'void usage()':
/usr/include/c++/9/bits/stl_vector.h:1195:4: note: parameter passing for argument of type '__gnu_cxx::__normal_iterator<MR::App::Argument*, std::vector<MR::App::Argument, std::allocator<MR::App::Argument> > >' changed in GCC 7.1
 1195 |    _M_realloc_insert(end(), __x);
      |    ^~~~~~~~~~~~~~~~~
/usr/include/c++/9/bits/stl_vector.h:1195:4: note: parameter passing for argument of type '__gnu_cxx::__normal_iterator<MR::App::Argument*, std::vector<MR::App::Argument, std::allocator<MR::App::Argument> > >' changed in GCC 7.1
 1195 |    _M_realloc_insert(end(), __x);
      |    ^~~~~~~~~~~~~~~~~


make[1]: *** [debian/rules:39: override_dh_auto_build] Error 1
make[1]: Leaving directory '/<<BUILDDIR>>/mrtrix3-3.0~rc3+git135-g2b8e7d0c2'
make: *** [debian/rules:33: build-arch] Error 2

Tail of log for gtk-d on armhf:

/usr/bin/ld: ./libgtkd-3.a(ColorSelection.o): in function `_D3std4conv17__T6toImplTAyaTkZ6toImplFNaNbNekkE3std5ascii10LetterCaseZAya':
./generated/gtkd/gtk/ColorSelection.d:401: multiple definition of `_DT24_D3gtk6Widget6Widget10__mixin37716buildableGetNameMFZAya'; ./libgtkd-3.a(MessageDialog.o):./generated/gtkd/gtk/MessageDialog.d:290: first defined here
/usr/bin/ld: ./libgtkd-3.a(ColorSelection.o): in function `_D3std4conv17__T6toImplTAyaTkZ6toImplFNaNbNekkE3std5ascii10LetterCaseZAya':
./generated/gtkd/gtk/ColorSelection.d:401: multiple definition of `_DT24_D3gtk6Widget6Widget10__mixin37714parserFinishedMFC3gtk7Builder7BuilderZv'; ./libgtkd-3.a(MessageDialog.o):./generated/gtkd/gtk/MessageDialog.d:290: first defined here
/usr/bin/ld: ./libgtkd-3.a(ColorSelection.o): in function `_D3std4conv17__T6toImplTAyaTkZ6toImplFNaNbNekkE3std5ascii10LetterCaseZAya':
./generated/gtkd/gtk/ColorSelection.d:401: multiple definition of `_DT24_D3gtk6Widget6Widget10__mixin37720setBuildablePropertyMFC3gtk7Builder7BuilderAyaC7gobject5Value5ValueZv'; ./libgtkd-3.a(MessageDialog.o):./generated/gtkd/gtk/MessageDialog.d:290: first defined here
/usr/bin/ld: ./libgtkd-3.a(ColorSelection.o): in function `_D3std4conv17__T6toImplTAyaTkZ6toImplFNaNbNekkE3std5ascii10LetterCaseZAya':
./generated/gtkd/gtk/ColorSelection.d:401: multiple definition of `_DT24_D3gtk6Widget6Widget10__mixin37716buildableSetNameMFAyaZv'; ./libgtkd-3.a(MessageDialog.o):./generated/gtkd/gtk/MessageDialog.d:290: first defined here
collect2: error: ld returned 1 exit status
make[2]: *** [GNUmakefile:252: TestWindow] Error 1
make[2]: Leaving directory '/<<PKGBUILDDIR>>'
dh_auto_build: make -j4 "INSTALL=install --strip-program=true" test shared prefix=/usr returned exit code 2
make[1]: *** [debian/rules:19: override_dh_auto_build] Error 255
make[1]: Leaving directory '/<<PKGBUILDDIR>>'
make: *** [debian/rules:16: build-arch] Error 2

Tail of log for flang on armhf:

make[3]: Leaving directory '/<<PKGBUILDDIR>>/debian/build/runtime/libpgmath'
Install the project...
-- Install configuration: ""
-- Installing: /<<PKGBUILDDIR>>/debian/tmp/usr/lib/libpgmath.so.0d
-- Installing: /<<PKGBUILDDIR>>/debian/tmp/usr/lib/libpgmath.so
-- Installing: /<<PKGBUILDDIR>>/debian/tmp/usr/lib/libpgmath.a
make[2]: Leaving directory '/<<PKGBUILDDIR>>/debian/build/runtime/libpgmath'
# Do in install scripts; fails within pdebuild, why ?
( cd debian/build/stage2 && make VERBOSE=1 install DESTDIR=/<<PKGBUILDDIR>>/debian/tmp )
make[2]: Entering directory '/<<PKGBUILDDIR>>/debian/build/stage2'
make[2]: *** No rule to make target 'install'.  Stop.
make[2]: Leaving directory '/<<PKGBUILDDIR>>/debian/build/stage2'
make[1]: *** [debian/rules:66: override_dh_auto_install] Error 2
make[1]: Leaving directory '/<<PKGBUILDDIR>>'
make: *** [debian/rules:14: binary-arch] Error 2

Tail of log for kubrick on armhf:

   23 | #define LOOP(i,n) for(int ((i))=0; ((i))<((n)); ((i))++)
      |                           ^
/<<PKGBUILDDIR>>/src/cube.cpp:426:6: note: in expansion of macro 'LOOP'
  426 |      LOOP (i, nAxes) {
      |      ^~~~
make[4]: *** [src/CMakeFiles/kubrick.dir/build.make:118: src/CMakeFiles/kubrick.dir/cube.cpp.o] Error 1
make[4]: Leaving directory '/<<PKGBUILDDIR>>/obj-arm-linux-gnueabihf'
make[3]: *** [CMakeFiles/Makefile2:1147: src/CMakeFiles/kubrick.dir/all] Error 2
make[3]: Leaving directory '/<<PKGBUILDDIR>>/obj-arm-linux-gnueabihf'
make[2]: *** [Makefile:144: all] Error 2
make[2]: Leaving directory '/<<PKGBUILDDIR>>/obj-arm-linux-gnueabihf'
dh_auto_build: cd obj-arm-linux-gnueabihf && make -j4 "INSTALL=install --strip-program=true" returned exit code 2
make[1]: *** [/usr/share/pkg-kde-tools/qt-kde-team/3/dhmk.mk:97: pre_build-arch_dh_auto_build] Error 255
make[1]: Leaving directory '/<<PKGBUILDDIR>>'
make: *** [/usr/share/pkg-kde-tools/qt-kde-team/3/dhmk.mk:112: debian/dhmk_build-arch] Error 2

Tail of log for chromium-browser on armhf:

                 from ../../third_party/blink/renderer/platform/heap/garbage_collected.h:9,
                 from ../../third_party/blink/renderer/platform/heap/visitor.h:35,
                 from ../../third_party/blink/renderer/platform/bindings/script_wrappable_visitor.h:8,
                 from ../../third_party/blink/renderer/platform/bindings/script_wrappable_marking_visitor.h:9,
                 from ../../third_party/blink/renderer/platform/bindings/trace_wrapper_v8_reference.h:8,
                 from ../../third_party/blink/renderer/platform/bindings/script_wrappable.h:36,
                 from ../../third_party/ffmpeg/../../third_party/blink/renderer/platform/bindings/script_wrappable.cc:5,
                 from gen/third_party/blink/renderer/platform/platform_jumbo_7.cc:5:
../../third_party/blink/renderer/platform/wtf/hash_traits.h:384:8: note: 'WTF::HashTable<blink::UntracedMember<blink::ScriptWrappable>, WTF::KeyValuePair<blink::UntracedMember<blink::ScriptWrappable>, unsigned int>, WTF::KeyValuePairKeyExtractor, WTF::MemberHash<blink::ScriptWrappable>, WTF::HashMapValueTraits<WTF::HashTraits<blink::UntracedMember<blink::ScriptWrappable> >, WTF::HashTraits<unsigned int> >, WTF::HashTraits<blink::UntracedMember<blink::ScriptWrappable> >, WTF::PartitionAllocator>::ValueType' {aka 'struct WTF::KeyValuePair<blink::UntracedMember<blink::ScriptWrappable>, unsigned int>'} declared here
  384 | struct KeyValuePair {
      |        ^~~~~~~~~~~~
ninja: build stopped: subcommand failed.
make[1]: *** [debian/rules:139: override_dh_auto_build-arch] Error 1
make[1]: Leaving directory '/<<PKGBUILDDIR>>'
make: *** [debian/rules:120: binary-arch] Error 2

Tail of log for appstream-generator on armhf:

/<<PKGBUILDDIR>>/src/asgen/containers/lists.d:90:16: error: no identifier for declarator _error_
   90 |         static foreach(index;0..N) {
      |                ^
/<<PKGBUILDDIR>>/src/asgen/containers/lists.d:150:16: error: basic type expected, not foreach
  150 |         static foreach(i;0..N) {
      |                ^
/<<PKGBUILDDIR>>/src/asgen/containers/lists.d:150:16: error: no identifier for declarator _error_
  150 |         static foreach(i;0..N) {
      |                ^
[29/146] gdc -Isrc/asgen/55ff84b@@appstream-generator@exe -Isrc/asgen -I../src/asgen -Isrc/ -I../src/ -Igirepo -I../girepo -I/usr/include/d/glibd-2 -I/usr/include/libmount -I/usr/include/blkid -I/usr/include/glib-2.0 -I/usr/lib/arm-linux-gnueabihf/glib-2.0/include -I/usr/include/appstream -I/usr/include/cairo -I/usr/include/pixman-1 -I/usr/include/uuid -I/usr/include/freetype2 -I/usr/include/libpng16 -I/usr/include/gdk-pixbuf-2.0 -I/usr/include/librsvg-2.0 -I/usr/include/arm-linux-gnueabihf -I/usr/include/pango-1.0 -I/usr/include/fribidi '-Wl,--push-state,-no-as-needed -lcurl -Wl,--pop-state' -no-pie -g -O2 -fdebug-prefix-map=/<<PKGBUILDDIR>>=. -fstack-protector-strong -frelease -pthread -J../src/asgen/../../data -MD -MQ 'src/asgen/55ff84b@@appstream-generator@exe/bindings_cairo.d.o' -MF 'src/asgen/55ff84b@@appstream-generator@exe/bindings_cairo.d.o.deps' -o 'src/asgen/55ff84b@@appstream-generator@exe/bindings_cairo.d.o' -c ../src/asgen/bindings/cairo.d
[30/146] gdc -Isrc/asgen/55ff84b@@appstream-generator@exe -Isrc/asgen -I../src/asgen -Isrc/ -I../src/ -Igirepo -I../girepo -I/usr/include/d/glibd-2 -I/usr/include/libmount -I/usr/include/blkid -I/usr/include/glib-2.0 -I/usr/lib/arm-linux-gnueabihf/glib-2.0/include -I/usr/include/appstream -I/usr/include/cairo -I/usr/include/pixman-1 -I/usr/include/uuid -I/usr/include/freetype2 -I/usr/include/libpng16 -I/usr/include/gdk-pixbuf-2.0 -I/usr/include/librsvg-2.0 -I/usr/include/arm-linux-gnueabihf -I/usr/include/pango-1.0 -I/usr/include/fribidi '-Wl,--push-state,-no-as-needed -lcurl -Wl,--pop-state' -no-pie -g -O2 -fdebug-prefix-map=/<<PKGBUILDDIR>>=. -fstack-protector-strong -frelease -pthread -J../src/asgen/../../data -MD -MQ 'src/asgen/55ff84b@@appstream-generator@exe/bindings_fontconfig.d.o' -MF 'src/asgen/55ff84b@@appstream-generator@exe/bindings_fontconfig.d.o.deps' -o 'src/asgen/55ff84b@@appstream-generator@exe/bindings_fontconfig.d.o' -c ../src/asgen/bindings/fontconfig.d
[31/146] gdc -Isrc/asgen/55ff84b@@appstream-generator@exe -Isrc/asgen -I../src/asgen -Isrc/ -I../src/ -Igirepo -I../girepo -I/usr/include/d/glibd-2 -I/usr/include/libmount -I/usr/include/blkid -I/usr/include/glib-2.0 -I/usr/lib/arm-linux-gnueabihf/glib-2.0/include -I/usr/include/appstream -I/usr/include/cairo -I/usr/include/pixman-1 -I/usr/include/uuid -I/usr/include/freetype2 -I/usr/include/libpng16 -I/usr/include/gdk-pixbuf-2.0 -I/usr/include/librsvg-2.0 -I/usr/include/arm-linux-gnueabihf -I/usr/include/pango-1.0 -I/usr/include/fribidi '-Wl,--push-state,-no-as-needed -lcurl -Wl,--pop-state' -no-pie -g -O2 -fdebug-prefix-map=/<<PKGBUILDDIR>>=. -fstack-protector-strong -frelease -pthread -J../src/asgen/../../data -MD -MQ 'src/asgen/55ff84b@@appstream-generator@exe/bindings_appstream_utils.d.o' -MF 'src/asgen/55ff84b@@appstream-generator@exe/bindings_appstream_utils.d.o.deps' -o 'src/asgen/55ff84b@@appstream-generator@exe/bindings_appstream_utils.d.o' -c ../src/asgen/bindings/appstream_utils.d
ninja: build stopped: subcommand failed.
dh_auto_build: cd obj-arm-linux-gnueabihf && LC_ALL=C.UTF-8 ninja -j4 -v returned exit code 1
make: *** [debian/rules:15: build-arch] Error 255

Tail of log for colmap on armhf:

make[3]: *** [src/CMakeFiles/colmap.dir/build.make:1008: src/CMakeFiles/colmap.dir/ui/automatic_reconstruction_widget.cc.o] Error 1
make[3]: *** Waiting for unfinished jobs....
In file included from /<<BUILDDIR>>/colmap-3.6+dev2+git20191105/src/ui/main_window.h:50,
                 from /<<BUILDDIR>>/colmap-3.6+dev2+git20191105/src/ui/bundle_adjustment_widget.cc:35:
/<<BUILDDIR>>/colmap-3.6+dev2+git20191105/src/ui/model_viewer_widget.h:55:63: error: expected class-name before '{' token
   55 |                           protected QOpenGLFunctions_3_2_Core {
      |                                                               ^
make[3]: *** [src/CMakeFiles/colmap.dir/build.make:1021: src/CMakeFiles/colmap.dir/ui/bundle_adjustment_widget.cc.o] Error 1
make[3]: Leaving directory '/<<BUILDDIR>>/colmap-3.6+dev2+git20191105/obj-arm-linux-gnueabihf'
make[2]: *** [CMakeFiles/Makefile2:672: src/CMakeFiles/colmap.dir/all] Error 2
make[2]: Leaving directory '/<<BUILDDIR>>/colmap-3.6+dev2+git20191105/obj-arm-linux-gnueabihf'
make[1]: *** [Makefile:133: all] Error 2
make[1]: Leaving directory '/<<BUILDDIR>>/colmap-3.6+dev2+git20191105/obj-arm-linux-gnueabihf'
dh_auto_build: cd obj-arm-linux-gnueabihf && make -j4 "INSTALL=install --strip-program=true" returned exit code 2
make: *** [debian/rules:28: build-arch] Error 255

Tail of log for ccls on armhf:

      |  ~~~~~~~~~~~~~~~~~~~~~^~~~~~~~~~~~~~~~~~~~~~~~~
[100%] Linking CXX executable ccls
/usr/bin/cmake -E cmake_link_script CMakeFiles/ccls.dir/link.txt --verbose=1
/usr/bin/c++  -g -O2 -fdebug-prefix-map=/<<PKGBUILDDIR>>=. -fstack-protector-strong -Wformat -Werror=format-security -Wdate-time -D_FORTIFY_SOURCE=2  -Wl,-z,relro -Wl,-z,now CMakeFiles/ccls.dir/third_party/siphash.cc.o CMakeFiles/ccls.dir/src/clang_tu.cc.o CMakeFiles/ccls.dir/src/config.cc.o CMakeFiles/ccls.dir/src/filesystem.cc.o CMakeFiles/ccls.dir/src/fuzzy_match.cc.o CMakeFiles/ccls.dir/src/main.cc.o CMakeFiles/ccls.dir/src/include_complete.cc.o CMakeFiles/ccls.dir/src/indexer.cc.o CMakeFiles/ccls.dir/src/log.cc.o CMakeFiles/ccls.dir/src/lsp.cc.o CMakeFiles/ccls.dir/src/message_handler.cc.o CMakeFiles/ccls.dir/src/pipeline.cc.o CMakeFiles/ccls.dir/src/platform_posix.cc.o CMakeFiles/ccls.dir/src/platform_win.cc.o CMakeFiles/ccls.dir/src/position.cc.o CMakeFiles/ccls.dir/src/project.cc.o CMakeFiles/ccls.dir/src/query.cc.o CMakeFiles/ccls.dir/src/sema_manager.cc.o CMakeFiles/ccls.dir/src/serializer.cc.o CMakeFiles/ccls.dir/src/test.cc.o CMakeFiles/ccls.dir/src/utils.cc.o CMakeFiles/ccls.dir/src/working_files.cc.o CMakeFiles/ccls.dir/src/messages/ccls_call.cc.o CMakeFiles/ccls.dir/src/messages/ccls_info.cc.o CMakeFiles/ccls.dir/src/messages/ccls_inheritance.cc.o CMakeFiles/ccls.dir/src/messages/ccls_member.cc.o CMakeFiles/ccls.dir/src/messages/ccls_navigate.cc.o CMakeFiles/ccls.dir/src/messages/ccls_reload.cc.o CMakeFiles/ccls.dir/src/messages/ccls_vars.cc.o CMakeFiles/ccls.dir/src/messages/initialize.cc.o CMakeFiles/ccls.dir/src/messages/textDocument_code.cc.o CMakeFiles/ccls.dir/src/messages/textDocument_completion.cc.o CMakeFiles/ccls.dir/src/messages/textDocument_definition.cc.o CMakeFiles/ccls.dir/src/messages/textDocument_did.cc.o CMakeFiles/ccls.dir/src/messages/textDocument_foldingRange.cc.o CMakeFiles/ccls.dir/src/messages/textDocument_formatting.cc.o CMakeFiles/ccls.dir/src/messages/textDocument_document.cc.o CMakeFiles/ccls.dir/src/messages/textDocument_hover.cc.o CMakeFiles/ccls.dir/src/messages/textDocument_references.cc.o CMakeFiles/ccls.dir/src/messages/textDocument_rename.cc.o CMakeFiles/ccls.dir/src/messages/textDocument_signatureHelp.cc.o CMakeFiles/ccls.dir/src/messages/workspace.cc.o  -o ccls -Wl,-rpath,/usr/lib/llvm-8/lib: /usr/lib/llvm-8/lib/libclangIndex.a /usr/lib/llvm-8/lib/libclangFormat.a /usr/lib/llvm-8/lib/libclangTooling.a /usr/lib/llvm-8/lib/libclangToolingInclusions.a /usr/lib/llvm-8/lib/libclangToolingCore.a /usr/lib/llvm-8/lib/libclangFrontend.a /usr/lib/llvm-8/lib/libclangParse.a /usr/lib/llvm-8/lib/libclangSerialization.a /usr/lib/llvm-8/lib/libclangSema.a /usr/lib/llvm-8/lib/libclangAST.a /usr/lib/llvm-8/lib/libclangLex.a /usr/lib/llvm-8/lib/libclangDriver.a /usr/lib/llvm-8/lib/libclangBasic.a /usr/lib/llvm-8/lib/libclangFormat.a /usr/lib/llvm-8/lib/libclangToolingInclusions.a /usr/lib/llvm-8/lib/libclangToolingCore.a /usr/lib/llvm-8/lib/libclangEdit.a /usr/lib/llvm-8/lib/libclangAnalysis.a /usr/lib/llvm-8/lib/libclangRewrite.a /usr/lib/llvm-8/lib/libclangASTMatchers.a /usr/lib/llvm-8/lib/libclangAST.a /usr/lib/llvm-8/lib/libclangLex.a /usr/lib/llvm-8/lib/libclangBasic.a /usr/lib/llvm-8/lib/libLLVM-8.so.1 -pthread 
/usr/bin/ld: CMakeFiles/ccls.dir/src/pipeline.cc.o: undefined reference to symbol '__atomic_fetch_sub_8@@LIBATOMIC_1.0'
/usr/bin/ld: /usr/lib/arm-linux-gnueabihf/libatomic.so.1: error adding symbols: DSO missing from command line
collect2: error: ld returned 1 exit status
make[3]: *** [CMakeFiles/ccls.dir/build.make:726: ccls] Error 1
make[3]: Leaving directory '/<<PKGBUILDDIR>>/obj-arm-linux-gnueabihf'
make[2]: *** [CMakeFiles/Makefile2:140: CMakeFiles/ccls.dir/all] Error 2
make[2]: Leaving directory '/<<PKGBUILDDIR>>/obj-arm-linux-gnueabihf'
make[1]: *** [Makefile:133: all] Error 2
make[1]: Leaving directory '/<<PKGBUILDDIR>>/obj-arm-linux-gnueabihf'
dh_auto_build: cd obj-arm-linux-gnueabihf && make -j4 "INSTALL=install --strip-program=true" returned exit code 2
make: *** [debian/rules:15: binary-arch] Error 255

Tail of log for python-apsw on armhf:

src/apsw.c:1115:7: warning: 'PyObject_AsReadBuffer' is deprecated [-Wdeprecated-declarations]
 1115 |       asrb=PyObject_AsReadBuffer(value, (const void**)&buffer, &buflen);
      |       ^~~~
In file included from /usr/include/python3.7m/Python.h:147,
                 from src/apsw.c:74:
/usr/include/python3.7m/abstract.h:489:17: note: declared here
  489 | PyAPI_FUNC(int) PyObject_AsReadBuffer(PyObject *obj,
      |                 ^~~~~~~~~~~~~~~~~~~~~
creating build/lib.linux-armv7l-3.7
arm-linux-gnueabihf-gcc -pthread -shared -Wl,-O1 -Wl,-Bsymbolic-functions -Wl,-z,relro -Wl,-z,relro -Wl,-z,now -g -O2 -fdebug-prefix-map=/<<PKGBUILDDIR>>=. -fstack-protector-strong -Wformat -Werror=format-security -Wdate-time -D_FORTIFY_SOURCE=2 -g build/temp.linux-armv7l-3.7/src/apsw.o -lsqlite3 -o build/lib.linux-armv7l-3.7/apsw.cpython-37m-arm-linux-gnueabihf.so
touch build-ext-python3.7-stamp
dh_testdir
python3.8 setup.py build -g --enable=load_extension
make: python3.8: Command not found
make: *** [debian/rules:21: build-ext-python3.8-stamp] Error 127