Raspbian Package Auto-Building

Buildd status for globus-proxy-utils (stretch-staging)

Debian PTSTrackerChangelogBugspackages.d.obuildd.d.o

Package(s): Suite:
Compact mode Co-maintainers

ArchitectureVersionStatusForBuilddStateMiscLogs
Buildd exposure stats armhf  6.19-1Build-Attempted905d 13h 56mtestbuilddout-of-datenet:sourceold | all (6)

Tail of log for globus-proxy-utils on armhf:

============================================================================
Makefile:555: recipe for target 'test-suite.log' failed
make[4]: *** [test-suite.log] Error 1
make[4]: Leaving directory '/<<PKGBUILDDIR>>/test'
Makefile:661: recipe for target 'check-TESTS' failed
make[3]: *** [check-TESTS] Error 2
make[3]: Leaving directory '/<<PKGBUILDDIR>>/test'
Makefile:741: recipe for target 'check-am' failed
make[2]: *** [check-am] Error 2
make[2]: Leaving directory '/<<PKGBUILDDIR>>/test'
Makefile:462: recipe for target 'check-recursive' failed
make[1]: *** [check-recursive] Error 1
make[1]: Leaving directory '/<<PKGBUILDDIR>>'
debian/rules:55: recipe for target 'build-stamp' failed
make: *** [build-stamp] Error 2