Raspbian Package Auto-Building

Buildd status for gjh-asl-json (bullseye-staging)

Debian PTSTrackerChangelogBugspackages.d.obuildd.d.o

Package(s): Suite:
Compact mode Co-maintainers

ArchitectureVersionStatusForBuilddStateMiscLogs
Buildd exposure stats armhf  0.0+git20180428.eb8720e-2Build-Attempted35d 20h 50mmb-lxc-02uncompiledmisc:sourceold | all (2)

Tail of log for gjh-asl-json on armhf:

  280 | #define conval(x,r,ne)  (*((ASL*)asl)->p.Conval)((ASL*)asl,x,r,ne)
      |                                                                ^~
src/AmplInterface.cpp: In member function ‘void AmplInterface::eval_jac_c(const double*, double*) const’:
src/AmplInterface.cpp:920:37: error: invalid conversion from ‘int*’ to ‘fint*’ {aka ‘long int*’} [-fpermissive]
  920 |    jacval((double*)x, jac_c_values, &nerror);
      |                                     ^~~~~~~
      |                                     |
      |                                     int*
/usr/include/ampl-netlib-solvers/asl.h:281:64: note: in definition of macro ‘jacval’
  281 | #define jacval(x,j,ne)  (*((ASL*)asl)->p.Jacval)((ASL*)asl,x,j,ne)
      |                                                                ^~
make[1]: *** [Makefile:25: src/AmplInterface.o] Error 1
make[1]: Leaving directory '/<<BUILDDIR>>/gjh-asl-json-0.0+git20180428.eb8720e'
dh_auto_build: error: make -j4 "INSTALL=install --strip-program=true" returned exit code 2
make: *** [debian/rules:21: binary-arch] Error 25