Raspbian Package Auto-Building

Buildd status for gfccore (wheezy-staging)

Debian PTSTrackerChangelogBugspackages.d.obuildd.d.o

Package(s): Suite:
Compact mode Co-maintainers

ArchitectureVersionStatusForBuilddStateMiscLogs
Buildd exposure stats armhf  2.3.1-7.1Build-Attempted1356d 18h 50mbm-wb-01uncompiledlibs:sourceold | all (5)

Tail of log for gfccore on armhf:

 g++ -DHAVE_CONFIG_H -I. -I. -I../.. -D_FORTIFY_SOURCE=2 -g -O2 -fstack-protector --param=ssp-buffer-size=4 -Wformat -Werror=format-security -Wall -pthread -I/usr/include/glib-2.0 -I/usr/lib/arm-linux-gnueabihf/glib-2.0/include -I/usr/include/sigc++-2.0 -I/usr/lib/arm-linux-gnueabihf/sigc++-2.0/include -g -O2 -fstack-protector --param=ssp-buffer-size=4 -Wformat -Werror=format-security -Wall -c completion.cc  -fPIC -DPIC -o .libs/completion.o
In file included from completion.cc:21:0:
completion.hh:33:30: fatal error: glib/gcompletion.h: No such file or directory
compilation terminated.
make[5]: *** [completion.lo] Error 1
make[5]: Leaving directory `/<<PKGBUILDDIR>>/gfc/glib'
make[4]: *** [all-recursive] Error 1
make[4]: Leaving directory `/<<PKGBUILDDIR>>/gfc/glib'
make[3]: *** [all-recursive] Error 1
make[3]: Leaving directory `/<<PKGBUILDDIR>>/gfc'
make[2]: *** [all-recursive] Error 1
make[2]: Leaving directory `/<<PKGBUILDDIR>>'
make[1]: *** [all] Error 2
make[1]: Leaving directory `/<<PKGBUILDDIR>>'
make: *** [debian/stamp-makefile-build] Error 2