Raspbian Package Auto-Building

Buildd status for gatb-core (bullseye-staging)

Debian PTSTrackerChangelogBugspackages.d.obuildd.d.o

Package(s): Suite:
Compact mode Co-maintainers

ArchitectureVersionStatusForBuilddStateMiscLogs
Buildd exposure stats armhf  1.4.1+git20190813.a73b6dd+dfsg-1Build-Attempted13d 18h 54mbm-wb-02uncompiledmisc:extraold | all (3)

Tail of log for gatb-core on armhf:

/usr/bin/ld: /usr/include/c++/9/bits/atomic_base.h:419: undefined reference to `__atomic_load_8'
/usr/bin/ld: /usr/include/c++/9/bits/atomic_base.h:419: undefined reference to `__atomic_load_8'
/usr/bin/ld: CMakeFiles/gatb-core-cppunit.dir/src/bcalm/TestBcalm.cpp.o: in function `std::__atomic_base<unsigned long long>::compare_exchange_weak(unsigned long long&, unsigned long long, std::memory_order, std::memory_order)':
/usr/include/c++/9/bits/atomic_base.h:457: undefined reference to `__atomic_compare_exchange_8'
collect2: error: ld returned 1 exit status
make[4]: *** [test/unit/CMakeFiles/gatb-core-cppunit.dir/build.make:440: bin/None/gatb-core-cppunit] Error 1
make[4]: Leaving directory '/<<BUILDDIR>>/gatb-core-1.4.1+git20190813.a73b6dd+dfsg/obj-arm-linux-gnueabihf'
make[3]: *** [CMakeFiles/Makefile2:338: test/unit/CMakeFiles/gatb-core-cppunit.dir/all] Error 2
make[3]: Leaving directory '/<<BUILDDIR>>/gatb-core-1.4.1+git20190813.a73b6dd+dfsg/obj-arm-linux-gnueabihf'
make[2]: *** [Makefile:155: all] Error 2
make[2]: Leaving directory '/<<BUILDDIR>>/gatb-core-1.4.1+git20190813.a73b6dd+dfsg/obj-arm-linux-gnueabihf'
dh_auto_build: cd obj-arm-linux-gnueabihf && make -j4 "INSTALL=install --strip-program=true" returned exit code 2
make[1]: *** [debian/rules:13: override_dh_auto_build-arch] Error 255
make[1]: Leaving directory '/<<BUILDDIR>>/gatb-core-1.4.1+git20190813.a73b6dd+dfsg'
make: *** [debian/rules:10: build-arch] Error 2