Raspbian Package Auto-Building

Buildd status for freefoam (jessie-staging)

Debian PTSTrackerChangelogBugspackages.d.obuildd.d.o

Package(s): Suite:
Compact mode Co-maintainers

ArchitectureVersionStatusForBuilddStateMiscLogs
Buildd exposure stats armhf  0.1.0+dfsg+1-3Build-Attempted127d 13h 27mmb-lxc-01uncompiledscience:sourceold | all (10)

Tail of log for freefoam on armhf:

c++: error: CMakeFiles/OSspecific.dir/__/OSspecific/sigQuit.C.o: No such file or directory
src/OSspecific/POSIX/CMakeFiles/OSspecific.dir/build.make:103: recipe for target 'src/OSspecific/POSIX/CMakeFiles/OSspecific.dir/__/OSspecific/sigInt.C.o' failed
make[3]: *** [src/OSspecific/POSIX/CMakeFiles/OSspecific.dir/__/OSspecific/sigInt.C.o] Error 1
src/OSspecific/POSIX/CMakeFiles/OSspecific.dir/build.make:126: recipe for target 'src/OSspecific/POSIX/CMakeFiles/OSspecific.dir/__/OSspecific/sigQuit.C.o' failed
make[3]: *** [src/OSspecific/POSIX/CMakeFiles/OSspecific.dir/__/OSspecific/sigQuit.C.o] Error 1
make[3]: Leaving directory '/<<BUILDDIR>>/freefoam-0.1.0+dfsg+1/obj-arm-linux-gnueabihf'
CMakeFiles/Makefile2:463: recipe for target 'src/OSspecific/POSIX/CMakeFiles/OSspecific.dir/all' failed
make[2]: *** [src/OSspecific/POSIX/CMakeFiles/OSspecific.dir/all] Error 2
make[2]: Leaving directory '/<<BUILDDIR>>/freefoam-0.1.0+dfsg+1/obj-arm-linux-gnueabihf'
Makefile:120: recipe for target 'all' failed
make[1]: *** [all] Error 2
make[1]: Leaving directory '/<<BUILDDIR>>/freefoam-0.1.0+dfsg+1/obj-arm-linux-gnueabihf'
dh_auto_build: make -j4 returned exit code 2
debian/rules:3: recipe for target 'build-arch' failed
make: *** [build-arch] Error 2