Raspbian Package Auto-Building

Buildd status for freefoam (buster-staging)

Debian PTSTrackerChangelogBugspackages.d.obuildd.d.o

Package(s): Suite:
Compact mode Co-maintainers

ArchitectureVersionStatusForBuilddStateMiscLogs
Buildd exposure stats armhf  0.1.0+dfsg+1-4Build-Attempted164d 6h 31mtestwandboarduncompiledscience:sourceold | all (30)

Tail of log for freefoam on armhf:

/usr/bin/cmake -E cmake_link_script CMakeFiles/cmTC_b1d57.dir/link.txt --verbose=1
/usr/bin/cc -g -O2 -fdebug-prefix-map=/<<BUILDDIR>>/freefoam-0.1.0+dfsg+1=. -fstack-protector-strong -Wformat -Werror=format-security -Wdate-time -D_FORTIFY_SOURCE=2 -DCHECK_FUNCTION_EXISTS=handle_sigfpes  -Wl,-z,relro  -rdynamic CMakeFiles/cmTC_b1d57.dir/CheckFunctionExists.c.o  -o cmTC_b1d57 
/usr/bin/ld: CMakeFiles/cmTC_b1d57.dir/CheckFunctionExists.c.o: in function `main':
/usr/share/cmake-3.13/Modules/CheckFunctionExists.c:17: undefined reference to `handle_sigfpes'
collect2: error: ld returned 1 exit status
make[3]: *** [CMakeFiles/cmTC_b1d57.dir/build.make:87: cmTC_b1d57] Error 1
make[3]: Leaving directory '/<<BUILDDIR>>/freefoam-0.1.0+dfsg+1/obj-arm-linux-gnueabihf/CMakeFiles/CMakeTmp'
make[2]: *** [Makefile:121: cmTC_b1d57/fast] Error 2
make[2]: Leaving directory '/<<BUILDDIR>>/freefoam-0.1.0+dfsg+1/obj-arm-linux-gnueabihf/CMakeFiles/CMakeTmp'


dh_auto_configure: cd obj-arm-linux-gnueabihf && cmake -DCMAKE_INSTALL_PREFIX=/usr -DCMAKE_BUILD_TYPE=None -DCMAKE_INSTALL_SYSCONFDIR=/etc -DCMAKE_INSTALL_LOCALSTATEDIR=/var -DCMAKE_EXPORT_NO_PACKAGE_REGISTRY=ON -DCMAKE_FIND_PACKAGE_NO_PACKAGE_REGISTRY=ON "-GUnix Makefiles" -DCMAKE_VERBOSE_MAKEFILE=ON -DCMAKE_INSTALL_LIBDIR=lib/arm-linux-gnueabihf -DFOAM_EXE_PREFIX=freefoam- -DFOAM_ENABLE_METIS=OFF -DFOAM_ENABLE_MGRIDGEN=OFF -DFOAM_USE_MPI=ON -DFOAM_DEFAULT_PSTREAM=mpi -DFOAM_DOUBLE_PRECISION=ON -DFOAM_ENABLE_PARMETIS=OFF -DCMAKE_SKIP_RPATH=OFF -DFOAM_ENABLE_CCMIO=OFF -DBUILD_TESTING=OFF -DFOAM_ENABLE_FULL_TUTORIAL_TEST=OFF -DFOAM_BUILD_PRIVATE_METIS=OFF -DFOAM_BUILD_PRIVATE_PARMETIS=OFF -DFOAM_BUILD_PRIVATE_SCOTCH=OFF -DFOAM_BUILD_PRIVATE_ZLIB=OFF -DFOAM_ENABLE_PDF_GUIDES=OFF -DFOAM_ENABLE_XHTML_GUIDES=OFF -DFOAM_ENABLE_XHTML_HELP=OFF -DFOAM_ENABLE_MATHJAX=OFF -DFOAM_ENABLE_MANPAGE_HELP=OFF -DFOAM_DOCS_FOR_SF=OFF -DFOAM_INSTALL_BIN_PATH=/usr/bin -DFOAM_INSTALL_CMAKE_PATH=/usr/share/freefoam/CMake -DFOAM_INSTALL_CONFIG_PATH=/etc/freefoam -DFOAM_INSTALL_DATA_PATH=/usr/share/freefoam -DFOAM_INSTALL_DOC_PATH=/usr/share/doc/freefoam -DFOAM_INSTALL_HEADER_PATH=/usr/include/freefoam -DFOAM_INSTALL_LIBEXEC_PATH=/usr/bin -DFOAM_INSTALL_LIBRARY_PATH=/usr/lib/freefoam -DFOAM_INSTALL_MAN_PATH=/usr/share/man -DFOAM_INSTALL_PLUGIN_PATH=/usr/lib/freefoam/plugins1 -DFOAM_INSTALL_TUTORIALS_PATH=/usr/share/doc/freefoam -DFOAM_INSTALL_USERDFOAM_PATH=/usr/lib/freefoam/plugins1/ensightReader -DFOAM_ENABLE_DOXYGEN_DOCS=OFF .. returned exit code 1
make[1]: *** [debian/rules:68: override_dh_auto_configure] Error 2
make[1]: Leaving directory '/<<BUILDDIR>>/freefoam-0.1.0+dfsg+1'
make: *** [debian/rules:3: build-arch] Error 2