Raspbian Package Auto-Building

Buildd status for form (stretch-staging)

Debian PTSTrackerChangelogBugspackages.d.obuildd.d.o

Package(s): Suite:
Compact mode Co-maintainers

ArchitectureVersionStatusForBuilddStateMiscLogs
Buildd exposure stats armhf  4.1-1Build-Attempted907d 4h 28mbm-wb-02uncompiledmisc:sourceold | all (8)

Tail of log for form on armhf:

1 of 1 test failed
Please report to form@nikhef.nl
===============================
Makefile:236: recipe for target 'check-TESTS' failed
make[3]: *** [check-TESTS] Error 1
make[3]: Leaving directory '/<<PKGBUILDDIR>>/check'
Makefile:359: recipe for target 'check-am' failed
make[2]: *** [check-am] Error 2
make[2]: Leaving directory '/<<PKGBUILDDIR>>/check'
Makefile:311: recipe for target 'check-recursive' failed
make[1]: *** [check-recursive] Error 1
make[1]: Leaving directory '/<<PKGBUILDDIR>>'
dh_auto_test: make -j4 check VERBOSE=1 returned exit code 2
debian/rules:10: recipe for target 'build-arch' failed
make: *** [build-arch] Error 2