Raspbian Package Auto-Building

Buildd status for flatpak (buster-staging)

Debian PTSTrackerChangelogBugspackages.d.obuildd.d.o

Package(s): Suite:
Compact mode Co-maintainers

ArchitectureVersionStatusForBuilddStateMiscLogs
Buildd exposure stats armhf  1.2.5-0+deb10u1Build-Attempted24d 4h 39mtestbuilddout-of-datemisc:optionalold | all (1)

Tail of log for flatpak on armhf:

make[6]: *** Deleting file 'tests/test-override.sh.log'
make[6]: *** Deleting file 'tests/test-extensions.sh.log'
make[4]: *** [Makefile:5442: check-am] Terminated
make[2]: *** wait: No child processes.  Stop.
make[2]: *** Waiting for unfinished jobs....
make[2]: *** wait: No child processes.  Stop.
make[6]: *** [Makefile:5166: tests/test-extensions.sh.log] Terminated
make[6]: *** [Makefile:5194: tests/test-override.sh.log] Terminated
make[6]: *** [Makefile:5033: tests/test-run@user,nodeltas.wrap.log] Terminated
make[6]: *** [Makefile:5040: tests/test-run@user,deltas.wrap.log] Terminated
E: Caught signal ‘Terminated’: terminating immediately
make: *** [debian/rules:11: binary-arch] Terminated
make[1]: *** wait: No child processes.  Stop.
make[1]: *** Waiting for unfinished jobs....
make[1]: *** wait: No child processes.  Stop.