Raspbian Package Auto-Building

Buildd status for flatpak (bullseye-staging)

Debian PTSTrackerChangelogBugspackages.d.obuildd.d.o

Package(s): Suite:
Compact mode Co-maintainers

ArchitectureVersionStatusForBuilddStateMiscLogs
Buildd exposure stats armhf  1.8.2-3Build-Attempted5d 17h 10mbm-wb-01out-of-datemisc:optionalold | all (1)

Tail of log for flatpak on armhf:

PASS: tests/test-repo@system-norevokefs.wrap 14 handles version requirements
PASS: tests/test-repo@system-norevokefs.wrap 15 update metadata
PASS: tests/test-repo@system-norevokefs.wrap 16 eol build-commit-from
PASS: tests/test-repo@system-norevokefs.wrap 17 eol build-export
ERROR: tests/test-repo@system-norevokefs.wrap - too few tests run (expected 37, got 17)
ERROR: tests/test-repo@system-norevokefs.wrap - exited with status 1
make[6]: *** Deleting file 'tests/test-update-portal.sh.log'
E: Caught signal ‘Terminated’: terminating immediately
make[3]: *** [Makefile:5564: check-recursive] Terminated
make[2]: *** [Makefile:6279: check] Terminated
make[5]: *** [Makefile:5787: check-TESTS] Terminated
make[4]: *** [Makefile:6276: check-am] Terminated
make[6]: *** [Makefile:6015: tests/test-update-portal.sh.log] Terminated
make: *** [debian/rules:11: binary-arch] Terminated
make[1]: *** [debian/rules:73: override_dh_auto_test-arch] Terminated