Raspbian Package Auto-Building

Buildd status for firefox-esr (bullseye-staging)

Debian PTSTrackerChangelogBugspackages.d.obuildd.d.o

Package(s): Suite:
Compact mode Co-maintainers

ArchitectureVersionStatusForBuilddStateMiscLogs
Buildd exposure stats armhf  78.5.0esr-1Build-Attempted10d 2h 1mmb-lxc-02out-of-datemisc:optionalold | all (1)

Tail of log for firefox-esr on armhf:

config/external/icu/i18n/zonemeta.o
/usr/bin/g++ -std=gnu++17 -o zonemeta.o -c  -I/<<PKGBUILDDIR>>/build-browser/dist/system_wrappers -include /<<PKGBUILDDIR>>/config/gcc_hidden.h -U_FORTIFY_SOURCE -D_FORTIFY_SOURCE=2 -fstack-protector-strong -DNDEBUG=1 -DTRIMMED=1 -DU_I18N_IMPLEMENTATION -DU_USING_ICU_NAMESPACE=0 -DU_NO_DEFAULT_INCLUDE_UTF_HEADERS=1 -DU_HIDE_OBSOLETE_UTF_OLD_H=1 -DUCONFIG_NO_LEGACY_CONVERSION -DUCONFIG_NO_TRANSLITERATION -DUCONFIG_NO_REGULAR_EXPRESSIONS -DU_CHARSET_IS_UTF8 -DUNISTR_FROM_CHAR_EXPLICIT=explicit -DUNISTR_FROM_STRING_EXPLICIT=explicit -DU_ENABLE_DYLOAD=0 -DU_HAVE_NL_LANGINFO_CODESET=0 -I/<<PKGBUILDDIR>>/config/external/icu/i18n -I/<<PKGBUILDDIR>>/build-browser/config/external/icu/i18n -I/<<PKGBUILDDIR>>/intl/icu/source/common -I/<<PKGBUILDDIR>>/build-browser/dist/include -I/usr/include/nspr -I/usr/include/nss -I/usr/include/nspr -I/<<PKGBUILDDIR>>/build-browser/dist/include/nss -fPIC -DMOZILLA_CLIENT -include /<<PKGBUILDDIR>>/build-browser/mozilla-config.h -Wdate-time -D_FORTIFY_SOURCE=2 -Wall -Wempty-body -Wignored-qualifiers -Woverloaded-virtual -Wpointer-arith -Wsign-compare -Wtype-limits -Wunreachable-code -Wwrite-strings -Wno-invalid-offsetof -Wc++2a-compat -Wduplicated-cond -Wimplicit-fallthrough -Wunused-function -Wunused-variable -Wno-error=maybe-uninitialized -Wno-error=deprecated-declarations -Wno-error=array-bounds -Wno-error=coverage-mismatch -Wno-error=free-nonheap-object -Wno-multistatement-macros -Wno-error=class-memaccess -Wno-error=deprecated-copy -Wformat -Wformat-overflow=2 -fno-sized-deallocation -fno-aligned-new -O2 -fdebug-prefix-map=/<<PKGBUILDDIR>>=. -fstack-protector-strong -Wformat -Werror=format-security -fno-exceptions -fno-strict-aliasing -fno-rtti -ffunction-sections -fdata-sections -fno-exceptions -fno-math-errno -pthread -pipe -freorder-blocks -O2 -fomit-frame-pointer -funwind-tables -frtti  -MD -MP -MF .deps/zonemeta.o.pp   /<<PKGBUILDDIR>>/intl/icu/source/i18n/zonemeta.cpp
make[5]: Leaving directory '/<<PKGBUILDDIR>>/build-browser/config/external/icu/i18n'
    Finished release [optimized] target(s) in 80m 19s
/<<PKGBUILDDIR>>/build-browser/_virtualenvs/init_py3/bin/python -m mozbuild.action.check_binary --target --networking /<<PKGBUILDDIR>>/build-browser/arm-unknown-linux-gnueabihf/release/libgkrust.a
make[5]: Leaving directory '/<<PKGBUILDDIR>>/build-browser/toolkit/library/rust'
make[4]: Leaving directory '/<<PKGBUILDDIR>>/build-browser'
make[3]: *** [/<<PKGBUILDDIR>>/config/recurse.mk:34: compile] Error 2
make[3]: Leaving directory '/<<PKGBUILDDIR>>/build-browser'
make[2]: *** [/<<PKGBUILDDIR>>/config/rules.mk:390: default] Error 2
make[2]: Leaving directory '/<<PKGBUILDDIR>>/build-browser'
dh_auto_build: error: cd build-browser && make -j4 LD_LIBS=-Wl,--no-gc-sections _LEAKTEST_FILES=leaktest.py returned exit code 2
make[1]: *** [debian/rules:240: stamps/build-browser] Error 25
make[1]: Leaving directory '/<<PKGBUILDDIR>>'
make: *** [debian/rules:336: build-arch] Error 2