Raspbian Package Auto-Building

Buildd status for fflas-ffpack (bullseye-staging)

Debian PTSTrackerChangelogBugspackages.d.obuildd.d.o

Package(s): Suite:
Compact mode Co-maintainers

ArchitectureVersionStatusForBuilddStateMiscLogs
Buildd exposure stats armhf  2.4.3-2Build-Attempted45d 12hbm-wb-02out-of-datemath:sourceold | all (1)

Tail of log for fflas-ffpack on armhf:

make[5]: *** Deleting file 'test-fsytrf.log'
make[5]: *** [Makefile:1972: test-fsytrf.log] Terminated
make[4]: *** wait: No child processes.  Stop.
make[4]: *** Waiting for unfinished jobs....
make[4]: *** wait: No child processes.  Stop.
make[2]: *** wait: No child processes.  Stop.
make[2]: *** Waiting for unfinished jobs....
make[2]: *** wait: No child processes.  Stop.
E: Caught signal ‘Terminated’: terminating immediately
make[1]: *** wait: No child processes.  Stop.
make[1]: *** Waiting for unfinished jobs....
make[1]: *** wait: No child processes.  Stop.
make[3]: *** [Makefile:2171: check-am] Error 2
Terminated
make: *** [debian/rules:42: binary-arch] Terminated