Raspbian Package Auto-Building

Buildd status for selected packages (bullseye-staging)

Bugs

Package(s): Suite:
Compact mode Co-maintainers

Package armhf
Buildd exposure stats
✘ fermi-lite  Build-Attempted
✘ proteinortho  Build-Attempted
✘ scamp  Build-Attempted
✘ wrk  Build-Attempted
✘ uvloop  Build-Attempted
✘ consul  Build-Attempted
✘ afnix  Build-Attempted
✔ bedtoolsInstalled
✔ collectdInstalled
✔ ceres-solverInstalled
✔ phastInstalled
✘ sasmodels  Build-Attempted
✘ castle-game-engine  Build-Attempted
✘ llvm-toolchain-6.0  Build-Attempted
✘ xbindkeys-config  Build-Attempted
✔ gcc-9Installed
✘ me-tv  Build-Attempted
✘ gnome-mplayer  Build-Attempted
✘ lives  Build-Attempted
Package armhf
Buildd exposure stats
✘ theano  Build-Attempted
✘ pencil2d  Build-Attempted
✘ asyncpg  Build-Attempted
✘ dictd  Build-Attempted
✘ gnome-documents  Build-Attempted
✘ tnseq-transit  Build-Attempted
✘ flatpak  Build-Attempted
✘ ruby-eventmachine  Build-Attempted
✔ libyangInstalled
✘ boinc  Build-Attempted
✘ fakechroot  Build-Attempted
✘ ostree  Build-Attempted
✘ fflas-ffpack  Build-Attempted
✘ pbbam  Build-Attempted
✘ siridb-server  Build-Attempted
✘ pyzmq  Build-Attempted
✘ gnuradio  BD-Uninstallable
✔ cpp-hoconInstalled
✘ git-annex  Build-Attempted
✘ tor  Build-Attempted
Package armhf
Buildd exposure stats
✘ rauc  Build-Attempted
✔ gnome-builderInstalled

Tail of log for fermi-lite on armhf:

ar: `u' modifier ignored since `D' is the default (see `U')
cc -Wl,-z,relro -Wl,-z,now -g -O2 -fdebug-prefix-map=/<<PKGBUILDDIR>>=. -fstack-protector-strong -Wformat -Werror=format-security -DSIMDE_ENABLE_OPENMP -fopenmp-simd -O3 -g -Wall -O2 -fPIC   libfml.a example.o -o fml-asm -L. -lfml -lm -lz -lpthread
/usr/bin/ld: ./libfml.a(unitig.o): in function `set_bit':
./unitig.c:74: undefined reference to `__atomic_fetch_or_8'
/usr/bin/ld: ./unitig.c:74: undefined reference to `__atomic_fetch_or_8'
/usr/bin/ld: ./unitig.c:74: undefined reference to `__atomic_fetch_or_8'
/usr/bin/ld: ./unitig.c:74: undefined reference to `__atomic_fetch_or_8'
/usr/bin/ld: ./unitig.c:74: undefined reference to `__atomic_fetch_or_8'
/usr/bin/ld: ./libfml.a(unitig.o):./unitig.c:74: more undefined references to `__atomic_fetch_or_8' follow
collect2: error: ld returned 1 exit status
make[1]: *** [Makefile:18: fml-asm] Error 1
make[1]: *** Waiting for unfinished jobs....
make[1]: Leaving directory '/<<PKGBUILDDIR>>'
dh_auto_build: error: make -j4 "INSTALL=install --strip-program=true" returned exit code 2
make: *** [debian/rules:12: binary-arch] Error 25

Tail of log for proteinortho on armhf:

- maybe the fasta files are mixed nucleotide and aminoacid sequences or just not suited for diamond? (For example diamond only processes protein sequences) Try 'proteinortho --step=1 --check --force /path/to/fastas'.  

If you cannot solve this error, please send a report to incoming+paulklemm-phd-proteinortho-7278443-issue-@incoming.gitlab.com including the parameter-vector above or visit https://gitlab.com/paulklemm_PHD/proteinortho/wikis/Error%20Codes for more help.
Further more all mails to lechner@staff.uni-marburg.de are welcome


Perl exited with active threads:
	7 running and unjoined
	0 finished and unjoined
	0 running and detached
Error, could not open file test_diamond.proteinortho.tsv: No such file or directory at ./src/chk_test.pl line 6.
make[1]: *** [Makefile:266: test_step2] Error 2
make[1]: Leaving directory '/<<BUILDDIR>>/proteinortho-6.0.24+dfsg'
dh_auto_test: error: make -j4 test returned exit code 2
make: *** [debian/rules:10: binary-arch] Error 25

Tail of log for scamp on armhf:

# ERROR: 0
============================================================================
See tests/test-suite.log
Please report to astromatic@astromatic.net
============================================================================
make[4]: *** [Makefile:781: test-suite.log] Error 1
make[4]: Leaving directory '/<<PKGBUILDDIR>>/tests'
make[3]: *** [Makefile:889: check-TESTS] Error 2
make[3]: Leaving directory '/<<PKGBUILDDIR>>/tests'
make[2]: *** [Makefile:991: check-am] Error 2
make[2]: Leaving directory '/<<PKGBUILDDIR>>/tests'
make[1]: *** [Makefile:535: check-recursive] Error 1
make[1]: Leaving directory '/<<PKGBUILDDIR>>'
dh_auto_test: error: make -j4 check VERBOSE=1 returned exit code 2
make: *** [debian/rules:7: binary-arch] Error 25

Tail of log for wrk on armhf:

cc -g -O2 -fdebug-prefix-map=/<<PKGBUILDDIR>>=. -fstack-protector-strong -Wformat -Werror=format-security -std=c99 -Wall -O2 -D_REENTRANT -D_POSIX_C_SOURCE=200112L -D_BSD_SOURCE -D_DEFAULT_SOURCE -I/usr/include/luajit-2.1 -Wdate-time -D_FORTIFY_SOURCE=2 -Iobj/include -I/usr/include -I/usr/include -c -o obj/http_parser.o src/http_parser.c
/bin/sh -c 'PATH=obj/bin:/usr/local/sbin:/usr/local/bin:/usr/sbin:/usr/bin:/sbin:/bin:/usr/games luajit -b /<<PKGBUILDDIR>>/src/wrk.lua /<<PKGBUILDDIR>>/obj/bytecode.o'
cc -Wl,-z,relro -Wl,-z,now -Wl,-E -Lobj/lib -L/usr/lib -L/usr/lib -o wrk obj/wrk.o obj/net.o obj/ssl.o obj/aprintf.o obj/stats.o obj/script.o obj/units.o obj/ae.o obj/zmalloc.o obj/http_parser.o obj/bytecode.o obj/version.o -lluajit-5.1 -lpthread -lm -lssl -lcrypto -ldl -lluajit-5.1
/usr/bin/ld: obj/stats.o: in function `stats_record':
./src/stats.c:24: undefined reference to `__atomic_fetch_add_8'
/usr/bin/ld: ./src/stats.c:25: undefined reference to `__atomic_fetch_add_8'
/usr/bin/ld: ./src/stats.c:29: undefined reference to `__atomic_compare_exchange_8'
/usr/bin/ld: ./src/stats.c:34: undefined reference to `__atomic_compare_exchange_8'
collect2: error: ld returned 1 exit status
make[2]: *** [Makefile:60: wrk] Error 1
make[2]: Leaving directory '/<<PKGBUILDDIR>>'
dh_auto_build: error: make -j4 "INSTALL=install --strip-program=true" WITH_LUAJIT=/usr WITH_OPENSSL=/usr VER=debian/4.1.0-3 returned exit code 2
make[1]: *** [debian/rules:17: override_dh_auto_build] Error 25
make[1]: Leaving directory '/<<PKGBUILDDIR>>'
make: *** [debian/rules:14: build-arch] Error 2

Tail of log for uvloop on armhf:

    await asyncio.gather(*coros, loop=self._loop)

-- Docs: https://docs.pytest.org/en/latest/warnings.html
======== 4 failed, 277 passed, 6 skipped, 10 warnings in 193.11 seconds ========
Unhandled error in exception handler
context: {'message': '_GatheringFuture exception was never retrieved', 'exception': CancelledError(), 'future': <_GatheringFuture finished exception=CancelledError()>}
Traceback (most recent call last):
  File "/usr/lib/python3.8/asyncio/base_events.py", line 1744, in call_exception_handler
    self._exception_handler(self, context)
  File "/<<BUILDDIR>>/uvloop-0.14.0+ds1/.pybuild/cpython3_3.8_uvloop/build/uvloop/_testbase.py", line 94, in loop_exception_handler
    self.loop.default_exception_handler(context)
AttributeError: 'NoneType' object has no attribute 'default_exception_handler'
E: pybuild pybuild:352: test: plugin distutils failed with: exit code=1: cd /<<BUILDDIR>>/uvloop-0.14.0+ds1/.pybuild/cpython3_3.8_uvloop/build; python3.8 -m pytest -s tests --ignore=tests/test_pipes.py --ignore=tests/test_sourcecode.py --ignore=tests/test_sockets.py --ignore=tests/test_tcp.py
dh_auto_test: error: pybuild --test --test-pytest -i python{version} -p 3.8 returned exit code 13
make: *** [debian/rules:14: build-arch] Error 25

Tail of log for consul on armhf:

    TestGenerateCert: generate_test.go:101: DM-skipped
--- SKIP: TestGenerateCert (0.00s)
=== CONT  TestGeneratePrivateKey
=== CONT  TestGenerateCA
--- PASS: TestGeneratePrivateKey (0.01s)
--- PASS: TestGenerateCA (0.01s)
PASS
ok  	github.com/hashicorp/consul/tlsutil	1.302s
?   	github.com/hashicorp/consul/types	[no test files]
?   	github.com/hashicorp/consul/version	[no test files]
FAIL
dh_auto_test: error: cd _build && go test -vet=off -v -p 4 -short -failfast -timeout 8m github.com/hashicorp/consul github.com/hashicorp/consul/acl github.com/hashicorp/consul/agent github.com/hashicorp/consul/agent/ae github.com/hashicorp/consul/agent/agentpb github.com/hashicorp/consul/agent/config github.com/hashicorp/consul/agent/debug github.com/hashicorp/consul/agent/exec github.com/hashicorp/consul/agent/local github.com/hashicorp/consul/agent/metadata github.com/hashicorp/consul/agent/mock github.com/hashicorp/consul/agent/pool github.com/hashicorp/consul/agent/router github.com/hashicorp/consul/agent/structs github.com/hashicorp/consul/agent/systemd github.com/hashicorp/consul/agent/token github.com/hashicorp/consul/agent/xds github.com/hashicorp/consul/command github.com/hashicorp/consul/command/acl github.com/hashicorp/consul/command/acl/agenttokens github.com/hashicorp/consul/command/acl/authmethod github.com/hashicorp/consul/command/acl/authmethod/create github.com/hashicorp/consul/command/acl/authmethod/delete github.com/hashicorp/consul/command/acl/authmethod/list github.com/hashicorp/consul/command/acl/authmethod/read github.com/hashicorp/consul/command/acl/authmethod/update github.com/hashicorp/consul/command/acl/bindingrule github.com/hashicorp/consul/command/acl/bindingrule/create github.com/hashicorp/consul/command/acl/bindingrule/delete github.com/hashicorp/consul/command/acl/bindingrule/list github.com/hashicorp/consul/command/acl/bindingrule/read github.com/hashicorp/consul/command/acl/bindingrule/update github.com/hashicorp/consul/command/acl/bootstrap github.com/hashicorp/consul/command/acl/policy github.com/hashicorp/consul/command/acl/policy/create github.com/hashicorp/consul/command/acl/policy/delete github.com/hashicorp/consul/command/acl/policy/list github.com/hashicorp/consul/command/acl/policy/read github.com/hashicorp/consul/command/acl/policy/update github.com/hashicorp/consul/command/acl/role github.com/hashicorp/consul/command/acl/role/create github.com/hashicorp/consul/command/acl/role/delete github.com/hashicorp/consul/command/acl/role/list github.com/hashicorp/consul/command/acl/role/read github.com/hashicorp/consul/command/acl/role/update github.com/hashicorp/consul/command/acl/rules github.com/hashicorp/consul/command/acl/token github.com/hashicorp/consul/command/acl/token/clone github.com/hashicorp/consul/command/acl/token/create github.com/hashicorp/consul/command/acl/token/delete github.com/hashicorp/consul/command/acl/token/list github.com/hashicorp/consul/command/acl/token/read github.com/hashicorp/consul/command/acl/token/update github.com/hashicorp/consul/command/agent github.com/hashicorp/consul/command/catalog github.com/hashicorp/consul/command/catalog/list/dc github.com/hashicorp/consul/command/catalog/list/nodes github.com/hashicorp/consul/command/catalog/list/services github.com/hashicorp/consul/command/config github.com/hashicorp/consul/command/config/delete github.com/hashicorp/consul/command/config/list github.com/hashicorp/consul/command/config/read github.com/hashicorp/consul/command/config/write github.com/hashicorp/consul/command/connect github.com/hashicorp/consul/command/connect/ca github.com/hashicorp/consul/command/connect/ca/get github.com/hashicorp/consul/command/connect/ca/set github.com/hashicorp/consul/command/connect/envoy github.com/hashicorp/consul/command/connect/envoy/pipe-bootstrap github.com/hashicorp/consul/command/connect/proxy github.com/hashicorp/consul/command/event github.com/hashicorp/consul/command/exec github.com/hashicorp/consul/command/flags github.com/hashicorp/consul/command/forceleave github.com/hashicorp/consul/command/helpers github.com/hashicorp/consul/command/info github.com/hashicorp/consul/command/intention github.com/hashicorp/consul/command/intention/check github.com/hashicorp/consul/command/intention/create github.com/hashicorp/consul/command/intention/delete github.com/hashicorp/consul/command/intention/finder github.com/hashicorp/consul/command/intention/get github.com/hashicorp/consul/command/intention/match github.com/hashicorp/consul/command/join github.com/hashicorp/consul/command/keygen github.com/hashicorp/consul/command/keyring github.com/hashicorp/consul/command/kv github.com/hashicorp/consul/command/kv/del github.com/hashicorp/consul/command/kv/exp github.com/hashicorp/consul/command/kv/get github.com/hashicorp/consul/command/kv/imp github.com/hashicorp/consul/command/kv/impexp github.com/hashicorp/consul/command/kv/put github.com/hashicorp/consul/command/leave github.com/hashicorp/consul/command/lock github.com/hashicorp/consul/command/login github.com/hashicorp/consul/command/logout github.com/hashicorp/consul/command/maint github.com/hashicorp/consul/command/members github.com/hashicorp/consul/command/monitor github.com/hashicorp/consul/command/operator github.com/hashicorp/consul/command/operator/autopilot github.com/hashicorp/consul/command/operator/autopilot/get github.com/hashicorp/consul/command/operator/autopilot/set github.com/hashicorp/consul/command/operator/raft github.com/hashicorp/consul/command/operator/raft/listpeers github.com/hashicorp/consul/command/operator/raft/removepeer github.com/hashicorp/consul/command/reload github.com/hashicorp/consul/command/rtt github.com/hashicorp/consul/command/services github.com/hashicorp/consul/command/services/deregister github.com/hashicorp/consul/command/services/register github.com/hashicorp/consul/command/snapshot github.com/hashicorp/consul/command/snapshot/inspect github.com/hashicorp/consul/command/snapshot/restore github.com/hashicorp/consul/command/snapshot/save github.com/hashicorp/consul/command/validate github.com/hashicorp/consul/command/version github.com/hashicorp/consul/command/watch github.com/hashicorp/consul/connect github.com/hashicorp/consul/connect/certgen github.com/hashicorp/consul/connect/proxy github.com/hashicorp/consul/ipaddr github.com/hashicorp/consul/lib github.com/hashicorp/consul/lib/file github.com/hashicorp/consul/lib/semaphore github.com/hashicorp/consul/logging github.com/hashicorp/consul/logging/monitor github.com/hashicorp/consul/sdk/freeport github.com/hashicorp/consul/sdk/testutil github.com/hashicorp/consul/sdk/testutil/retry github.com/hashicorp/consul/sentinel github.com/hashicorp/consul/service_os github.com/hashicorp/consul/snapshot github.com/hashicorp/consul/testrpc github.com/hashicorp/consul/tlsutil github.com/hashicorp/consul/types github.com/hashicorp/consul/version returned exit code 1
make[1]: *** [debian/rules:63: override_dh_auto_test] Error 25
make[1]: Leaving directory '/<<BUILDDIR>>/consul-1.7.4+dfsg1'
make: *** [debian/rules:25: build-arch] Error 2

Tail of log for afnix on armhf:

rm -rf bld
dh_clean
make[1]: Leaving directory '/<<PKGBUILDDIR>>'
   dh_clean
 debian/rules build-arch
dh build-arch
   dh_update_autotools_config -a
   dh_autoreconf -a
   debian/rules override_dh_auto_configure
make[1]: Entering directory '/<<PKGBUILDDIR>>'
./cnf/bin/afnix-setup -o --prefix=/usr
afnix-setup: cannot find compiler file error: cannot find version for compiler gcc
make[1]: *** [debian/rules:14: override_dh_auto_configure] Error 1
make[1]: Leaving directory '/<<PKGBUILDDIR>>'
make: *** [debian/rules:11: build-arch] Error 2

Tail of log for sasmodels on armhf:

LLVM ERROR: inconsistency in registered CommandLine options
: CommandLine Error: Option 'polly' registered more than once!
LLVM ERROR: inconsistency in registered CommandLine options
: CommandLine Error: Option 'polly' registered more than once!
LLVM ERROR: inconsistency in registered CommandLine options
: CommandLine Error: Option 'polly' registered more than once!
LLVM ERROR: inconsistency in registered CommandLine options
: CommandLine Error: Option 'polly' registered more than once!
LLVM ERROR: inconsistency in registered CommandLine options
E: Caught signal ‘Terminated’: terminating immediately
make[1]: *** [debian/rules:45: override_dh_auto_build] Terminated
make: *** wait: No child processes.  Stop.
make: *** Waiting for unfinished jobs....
make: *** wait: No child processes.  Stop.
make[2]: *** [Makefile:55: ref/models/index.rst] Terminated

Tail of log for castle-game-engine on armhf:

castlevectors_lists.inc(371,13) Error: Error in type definition
castlevectors_lists.inc(392,31) Error: Illegal qualifier
castlevectors_lists.inc(392,36) Error: Illegal qualifier
castlevectors_lists.inc(395,44) Error: Illegal qualifier
castlevectors_lists.inc(395,49) Error: Illegal qualifier
castlevectors_lists.inc(397,15) Error: Illegal qualifier
castlevectors_lists.inc(397,21) Error: Illegal qualifier
castlevectors_lists.inc(400,7) Error: Operator is not overloaded: inc "<erroneous type>"
castlevectors_lists.inc(403,5) Error: Operator is not overloaded: inc "<erroneous type>"
castlevectors.pas(196) Fatal: There were 10 errors compiling module, stopping
Fatal: Compilation aborted
Error: /usr/bin/ppcarm returned an error exitcode
make[1]: *** [debian/rules:64: prepare-source-stamp] Error 1
make[1]: Leaving directory '/<<BUILDDIR>>/castle-game-engine-6.4+dfsg1'
make: *** [debian/rules:52: binary-arch] Error 2

BinNMU changelog for llvm-toolchain-6.0 on armhf:

rebuild due to debcheck failure

Tail of log for llvm-toolchain-6.0 on armhf:

      |            ^~~~
/<<PKGBUILDDIR>>/lib/Target/SystemZ/SystemZFrameLowering.cpp: At global scope:
/<<PKGBUILDDIR>>/lib/Target/SystemZ/SystemZFrameLowering.cpp:562:1: fatal error: error writing to /tmp/cchtPH3M.s: No space left on device
  562 | }
      | ^
compilation terminated.
make[4]: *** [lib/Target/SystemZ/CMakeFiles/LLVMSystemZCodeGen.dir/build.make:131: lib/Target/SystemZ/CMakeFiles/LLVMSystemZCodeGen.dir/SystemZFrameLowering.cpp.o] Error 1
make[4]: Leaving directory '/<<PKGBUILDDIR>>/build-llvm'
make[3]: *** [CMakeFiles/Makefile2:25485: lib/Target/SystemZ/CMakeFiles/LLVMSystemZCodeGen.dir/all] Error 2
make[3]: Leaving directory '/<<PKGBUILDDIR>>/build-llvm'
make[2]: *** [Makefile:155: all] Error 2
make[2]: Leaving directory '/<<PKGBUILDDIR>>/build-llvm'
make[1]: *** [debian/rules:313: override_dh_auto_build] Error 2
make[1]: Leaving directory '/<<PKGBUILDDIR>>'
make: *** [debian/rules:185: build-arch] Error 2

BinNMU changelog for xbindkeys-config on armhf:

rebuild due to debcheck failure

Tail of log for xbindkeys-config on armhf:

speedc.c:53:7: warning: variable 'i' set but not used [-Wunused-but-set-variable]
   53 |   int i;
      |       ^
gcc -Wall -g -O2 xbindkeys_config.o menu.o middle.o speedc.o `pkg-config  --cflags --libs gtk+-2.0` -o xbindkeys_config
/usr/bin/ld: menu.o:/<<PKGBUILDDIR>>/middle.h:24: multiple definition of `label_warning'; xbindkeys_config.o:/<<PKGBUILDDIR>>/middle.h:24: first defined here
/usr/bin/ld: menu.o:/<<PKGBUILDDIR>>/middle.h:23: multiple definition of `button_undo_menu'; xbindkeys_config.o:/<<PKGBUILDDIR>>/middle.h:23: first defined here
/usr/bin/ld: middle.o:/<<PKGBUILDDIR>>/middle.h:24: multiple definition of `label_warning'; xbindkeys_config.o:/<<PKGBUILDDIR>>/middle.h:24: first defined here
/usr/bin/ld: middle.o:/<<PKGBUILDDIR>>/middle.h:23: multiple definition of `button_undo_menu'; xbindkeys_config.o:/<<PKGBUILDDIR>>/middle.h:23: first defined here
/usr/bin/ld: speedc.o:/<<PKGBUILDDIR>>/speedc.c:46: multiple definition of `Speed_config'; middle.o:/<<PKGBUILDDIR>>/middle.c:88: first defined here
/usr/bin/ld: speedc.o:/<<PKGBUILDDIR>>/middle.h:24: multiple definition of `label_warning'; xbindkeys_config.o:/<<PKGBUILDDIR>>/middle.h:24: first defined here
/usr/bin/ld: speedc.o:/<<PKGBUILDDIR>>/middle.h:23: multiple definition of `button_undo_menu'; xbindkeys_config.o:/<<PKGBUILDDIR>>/middle.h:23: first defined here
collect2: error: ld returned 1 exit status
make[1]: *** [Makefile:18: main] Error 1
make[1]: Leaving directory '/<<PKGBUILDDIR>>'
make: *** [debian/rules:23: build-stamp] Error 2

BinNMU changelog for me-tv on armhf:

rebuild due to debcheck failure

Tail of log for me-tv on armhf:

                 from main_window.cc:21:
/usr/include/gdkmm-2.4/gdkmm/color.h:264:6: note: candidate: 'bool Gdk::operator!=(const Gdk::Color&, const Gdk::Color&)'
  264 | bool operator!=(const Color& lhs, const Color& rhs);
      |      ^~~~~~~~
/usr/include/gdkmm-2.4/gdkmm/color.h:264:30: note:   no known conversion for argument 1 from 'Glib::RefPtr<Gdk::Window>' to 'const Gdk::Color&'
  264 | bool operator!=(const Color& lhs, const Color& rhs);
      |                 ~~~~~~~~~~~~~^~~
make[3]: *** [Makefile:676: main_window.o] Error 1
make[3]: Leaving directory '/<<PKGBUILDDIR>>/src'
make[2]: *** [Makefile:584: all-recursive] Error 1
make[2]: Leaving directory '/<<PKGBUILDDIR>>'
make[1]: *** [Makefile:419: all] Error 2
make[1]: Leaving directory '/<<PKGBUILDDIR>>'
dh_auto_build: error: make -j1 returned exit code 2
make: *** [debian/rules:3: build-arch] Error 25

BinNMU changelog for gnome-mplayer on armhf:

rebuild due to debcheck failure

Tail of log for gnome-mplayer on armhf:

      |          ^~~~~~~~~~~~~~~~~~
gcc -fPIC -pthread -I/usr/include/nautilus -I/usr/include/gtk-3.0 -I/usr/include/at-spi2-atk/2.0 -I/usr/include/at-spi-2.0 -I/usr/include/dbus-1.0 -I/usr/lib/arm-linux-gnueabihf/dbus-1.0/include -I/usr/include/gtk-3.0 -I/usr/include/gio-unix-2.0 -I/usr/include/cairo -I/usr/include/pango-1.0 -I/usr/include/fribidi -I/usr/include/harfbuzz -I/usr/include/atk-1.0 -I/usr/include/cairo -I/usr/include/pixman-1 -I/usr/include/uuid -I/usr/include/freetype2 -I/usr/include/libpng16 -I/usr/include/gdk-pixbuf-2.0 -I/usr/include/libmount -I/usr/include/blkid -I/usr/include/glib-2.0 -I/usr/lib/arm-linux-gnueabihf/glib-2.0/include -pthread -I/usr/include/gtk-3.0 -I/usr/include/at-spi2-atk/2.0 -I/usr/include/at-spi-2.0 -I/usr/include/dbus-1.0 -I/usr/lib/arm-linux-gnueabihf/dbus-1.0/include -I/usr/include/gtk-3.0 -I/usr/include/gio-unix-2.0 -I/usr/include/cairo -I/usr/include/pango-1.0 -I/usr/include/fribidi -I/usr/include/harfbuzz -I/usr/include/atk-1.0 -I/usr/include/cairo -I/usr/include/pixman-1 -I/usr/include/uuid -I/usr/include/freetype2 -I/usr/include/libpng16 -I/usr/include/gdk-pixbuf-2.0 -I/usr/include/libmount -I/usr/include/blkid -I/usr/include/glib-2.0 -I/usr/lib/arm-linux-gnueabihf/glib-2.0/include -pthread -I/usr/include/libmount -I/usr/include/blkid -I/usr/include/glib-2.0 -I/usr/lib/arm-linux-gnueabihf/glib-2.0/include -Wall -g   -DGIO_ENABLED -DHAVE_ASOUNDLIB  -DNOTIFY_ENABLED -DHAVE_GPOD -DGPOD_07 -DHAVE_MUSICBRAINZ -DLIBGDA_05 -g -O2 -fdebug-prefix-map=/<<PKGBUILDDIR>>=. -fstack-protector-strong -Wformat -Werror=format-security -shared -Wl,-z,relro -Wl,--as-needed -o libgnome-mplayer-properties-page.so libgnome_mplayer_properties_page_so-nautilus_property_page.o libgnome_mplayer_properties_page_so-property_page_common.o -lnautilus-extension -lgtk-3 -lgdk-3 -lpangocairo-1.0 -lpango-1.0 -lharfbuzz -latk-1.0 -lcairo-gobject -lcairo -lgdk_pixbuf-2.0 -lgio-2.0 -lgobject-2.0 -lglib-2.0 -lgtk-3 -lgdk-3 -lpangocairo-1.0 -lpango-1.0 -lharfbuzz -latk-1.0 -lcairo-gobject -lcairo -lgdk_pixbuf-2.0 -lgio-2.0 -lgobject-2.0 -lgthread-2.0 -pthread -lglib-2.0 -lgmlib -lgio-2.0 -lgobject-2.0 -lglib-2.0 
/usr/bin/ld: libgnome_mplayer_properties_page_so-property_page_common.o:./src/property_page_common.h:48: multiple definition of `verbose'; libgnome_mplayer_properties_page_so-nautilus_property_page.o:./src/property_page_common.h:48: first defined here
collect2: error: ld returned 1 exit status
make[4]: *** [Makefile:757: libgnome-mplayer-properties-page.so] Error 1
make[4]: *** Waiting for unfinished jobs....
make[4]: Leaving directory '/<<PKGBUILDDIR>>/src'
make[3]: *** [Makefile:861: all-recursive] Error 1
make[3]: Leaving directory '/<<PKGBUILDDIR>>/src'
make[2]: *** [Makefile:631: all-recursive] Error 1
make[2]: Leaving directory '/<<PKGBUILDDIR>>'
make[1]: *** [Makefile:463: all] Error 2
make[1]: Leaving directory '/<<PKGBUILDDIR>>'
dh_auto_build: error: make -j4 returned exit code 2
make: *** [debian/rules:12: build-arch] Error 25

BinNMU changelog for lives on armhf:

rebuild due to debcheck failure

Tail of log for lives on armhf:

/usr/bin/ld: giw/giwtimeline.o:./src/./widget-helper-gtk.h:960: multiple definition of `LIVES_STOCK_LABEL_OPEN'; widget-helper.o:./src/widget-helper-gtk.h:960: first defined here
/usr/bin/ld: giw/giwtimeline.o:./src/./widget-helper-gtk.h:959: multiple definition of `LIVES_STOCK_LABEL_SAVE_AS'; widget-helper.o:./src/widget-helper-gtk.h:959: first defined here
/usr/bin/ld: giw/giwtimeline.o:./src/./widget-helper-gtk.h:958: multiple definition of `LIVES_STOCK_LABEL_SAVE'; widget-helper.o:./src/widget-helper-gtk.h:958: first defined here
/usr/bin/ld: giw/giwtimeline.o:./src/./widget-helper-gtk.h:957: multiple definition of `LIVES_STOCK_LABEL_NO'; widget-helper.o:./src/widget-helper-gtk.h:957: first defined here
/usr/bin/ld: giw/giwtimeline.o:./src/./widget-helper-gtk.h:956: multiple definition of `LIVES_STOCK_LABEL_YES'; widget-helper.o:./src/widget-helper-gtk.h:956: first defined here
/usr/bin/ld: giw/giwtimeline.o:./src/./widget-helper-gtk.h:955: multiple definition of `LIVES_STOCK_LABEL_OK'; widget-helper.o:./src/widget-helper-gtk.h:955: first defined here
/usr/bin/ld: giw/giwtimeline.o:./src/./widget-helper-gtk.h:954: multiple definition of `LIVES_STOCK_LABEL_CANCEL'; widget-helper.o:./src/widget-helper-gtk.h:954: first defined here
/usr/bin/ld: giw/giwtimeline.o:./src/./support.h:23: multiple definition of `trString'; widget-helper.o:./src/support.h:23: first defined here
collect2: error: ld returned 1 exit status
make[2]: *** [Makefile:1000: lives-exe] Error 1
make[2]: Leaving directory '/<<PKGBUILDDIR>>/src'
make[1]: *** [Makefile:645: all-recursive] Error 1
make[1]: Leaving directory '/<<PKGBUILDDIR>>'
dh_auto_build: error: make -j4 returned exit code 2
make: *** [debian/rules:7: build-arch] Error 25

Tail of log for theano on armhf:

    nb, resources = super(ExecutePreprocessor, self).preprocess(nb, resources)
  File "/usr/lib/python3/dist-packages/nbconvert/preprocessors/base.py", line 69, in preprocess
    nb.cells[index], resources = self.preprocess_cell(cell, resources, index)
  File "/usr/lib/python3/dist-packages/nbconvert/preprocessors/execute.py", line 438, in preprocess_cell
    reply, outputs = self.run_cell(cell, cell_index, store_history)
  File "/usr/lib/python3/dist-packages/nbconvert/preprocessors/execute.py", line 571, in run_cell
    if self._passed_deadline(deadline):
  File "/usr/lib/python3/dist-packages/nbconvert/preprocessors/execute.py", line 541, in _passed_deadline
    self._handle_timeout()
  File "/usr/lib/python3/dist-packages/nbconvert/preprocessors/execute.py", line 504, in _handle_timeout
    raise TimeoutError("Cell execution timed out")
TimeoutError: Cell execution timed out
make[1]: *** [debian/rules:45: override_dh_auto_build] Error 1
make[1]: Leaving directory '/<<BUILDDIR>>/theano-1.0.5+dfsg'
make: *** [debian/rules:11: binary-arch] Error 2

Tail of log for pencil2d on armhf:

  426 |       vector<_Tp, _Alloc>::
      |       ^~~~~~~~~~~~~~~~~~~
/usr/include/c++/10/bits/vector.tcc:426:7: note: parameter passing for argument of type 'std::vector<Catch::SectionEndInfo>::iterator' changed in GCC 7.1
In file included from /usr/include/c++/10/vector:67,
                 from src/catch.hpp:465,
                 from src/main.cpp:18:
/usr/include/c++/10/bits/stl_vector.h: In member function 'virtual void Catch::RunContext::sectionEndedEarly(const Catch::SectionEndInfo&)':
/usr/include/c++/10/bits/stl_vector.h:1198:21: note: parameter passing for argument of type '__gnu_cxx::__normal_iterator<Catch::SectionEndInfo*, std::vector<Catch::SectionEndInfo> >' changed in GCC 7.1
 1198 |    _M_realloc_insert(end(), __x);
      |    ~~~~~~~~~~~~~~~~~^~~~~~~~~~~~
make[2]: Leaving directory '/<<PKGBUILDDIR>>/tests'
make[1]: *** [Makefile:135: sub-tests-make_first-ordered] Error 2
make[1]: Leaving directory '/<<PKGBUILDDIR>>'
dh_auto_build: error: make -j4 returned exit code 2
make: *** [debian/rules:17: binary-arch] Error 25

Tail of log for asyncpg on armhf:

Task was destroyed but it is pending!
task: <Task pending name='Task-1608' coro=<Event.wait() running at /usr/lib/python3.8/asyncio/locks.py:309> wait_for=<Future pending cb=[<TaskWakeupMethWrapper object at 0xb5cef130>()]> cb=[_wait.<locals>._on_completion() at /usr/lib/python3.8/asyncio/tasks.py:507]>
Task was destroyed but it is pending!
task: <Task pending name='Task-1612' coro=<Event.wait() running at /usr/lib/python3.8/asyncio/locks.py:309> wait_for=<Future pending cb=[<TaskWakeupMethWrapper object at 0xb5cefa48>()]> cb=[_wait.<locals>._on_completion() at /usr/lib/python3.8/asyncio/tasks.py:507]>
Task was destroyed but it is pending!
task: <Task pending name='Task-1599' coro=<Connection.proxy_to_backend() running at /<<PKGBUILDDIR>>/.pybuild/cpython3_3.8_asyncpg/build/asyncpg/_testbase/fuzzer.py:260> wait_for=<Future pending cb=[<TaskWakeupMethWrapper object at 0xb5cddd48>()]>>
Task was destroyed but it is pending!
task: <Task pending name='Task-1600' coro=<Connection.proxy_from_backend() running at /<<PKGBUILDDIR>>/.pybuild/cpython3_3.8_asyncpg/build/asyncpg/_testbase/fuzzer.py:286> wait_for=<Future pending cb=[<TaskWakeupMethWrapper object at 0xb5cdd778>()]>>
Task was destroyed but it is pending!
task: <Task pending name='Task-1607' coro=<BaseSelectorEventLoop.sock_recv() running at /usr/lib/python3.8/asyncio/selector_events.py:368> wait_for=<Future pending cb=[BaseSelectorEventLoop._sock_read_done(17)(), <TaskWakeupMethWrapper object at 0xb5cef178>()]>>
Task was destroyed but it is pending!
task: <Task pending name='Task-1611' coro=<BaseSelectorEventLoop.sock_recv() running at /usr/lib/python3.8/asyncio/selector_events.py:368> wait_for=<Future pending cb=[BaseSelectorEventLoop._sock_read_done(18)(), <TaskWakeupMethWrapper object at 0xb5cef988>()]>>
E: pybuild pybuild:352: test: plugin distutils failed with: exit code=1: cd /<<PKGBUILDDIR>>/.pybuild/cpython3_3.8_asyncpg/build; python3.8 -m pytest -k-test_flake8
dh_auto_test: error: pybuild --test --test-pytest -i python{version} -p 3.8 returned exit code 13
make: *** [debian/rules:8: build-arch] Error 25

Tail of log for dictd on armhf:

dpkg-source: info: using options from dictd-1.13.0+dfsg/debian/source/options: --diff-ignore --tar-ignore
 debian/rules clean
dh "clean"
   debian/rules override_dh_auto_clean
make[1]: Entering directory '/<<BUILDDIR>>/dictd-1.13.0+dfsg'
rm -f BUILD/build-arch-stamp BUILD/build-indep-stamp BUILD/configure-stamp
dh_auto_clean  -v -Sautoconf -BBUILD --parallel
	install -d /<<BUILDDIR>>/dictd-1.13.0\+dfsg/debian/.debhelper/generated/_source/home
rm -f core `find . \( -name '*.orig' -o -name '*.rej' -o -name '*~' \
        -o -name '*.bak' -o -name '#*#' -o -name '.*.orig' -o -name 'config.log' \
        -o -name '.*.rej' -o -name '.SUMS' -o -size 0 \) -print` TAGS
rm: cannot remove './debian/.debhelper/generated/_source/home': Is a directory
make[1]: *** [debian/rules:39: override_dh_auto_clean] Error 1
make[1]: Leaving directory '/<<BUILDDIR>>/dictd-1.13.0+dfsg'
make: *** [debian/rules:24: clean] Error 2

Tail of log for gnome-documents on armhf:

** (inkscape:16822): CRITICAL **: 06:39:30.905: dbus_g_connection_register_g_object: assertion 'connection != NULL' failed

** (inkscape:16822): WARNING **: 06:39:33.605: Fonts dir '/usr/share/inkscape/fonts' does not exist and will be ignored.
[42/45] /usr/bin/g-ir-compiler src/GdPrivate-1.0.gir --output src/GdPrivate-1.0.typelib --includedir=/<<PKGBUILDDIR>>/obj-arm-linux-gnueabihf/subprojects/libgd/libgd --includedir=/usr/share/gir-1.0
[43/45] /usr/bin/inkscape --export-filename getting-started/learn-more.pdf ../getting-started/C/learn-more.svg
Unable to init server: Could not connect: Connection refused
Failed to get connection
** (inkscape:16840): CRITICAL **: 06:39:34.100: dbus_g_proxy_new_for_name: assertion 'connection != NULL' failed

** (inkscape:16840): CRITICAL **: 06:39:34.100: dbus_g_proxy_call: assertion 'DBUS_IS_G_PROXY (proxy)' failed

** (inkscape:16840): CRITICAL **: 06:39:34.100: dbus_g_connection_register_g_object: assertion 'connection != NULL' failed

** (inkscape:16840): WARNING **: 06:39:36.366: Fonts dir '/usr/share/inkscape/fonts' does not exist and will be ignored.
[44/45] /usr/bin/pdfunite getting-started/landing.pdf getting-started/goa.pdf getting-started/bookmarking.pdf getting-started/scrubbing.pdf getting-started/editing.pdf getting-started/learn-more.pdf getting-started/gnome-documents-getting-started.pdf

Tail of log for tnseq-transit on armhf:

# read_length: 125 bp
# mean_R1_genomic_length: 121.6 bp
Removing tpp test file
Removing tpp test file
Removing tpp test file
Removing tpp test file
Removing tpp test file
Removing tpp test file
Removing tpp test file
Removing tpp test file
E: pybuild pybuild:352: test: plugin custom failed with: exit code=1: PYTHONPATH=tests python3.8 -m unittest -v tests/*.py
dh_auto_test: error: pybuild --test -i python{version} -p 3.8 --system=custom "--test-args=PYTHONPATH=tests {interpreter} -m unittest -v tests/*.py" returned exit code 13
make[1]: *** [debian/rules:23: override_dh_auto_test] Error 25
make[1]: Leaving directory '/<<PKGBUILDDIR>>'
make: *** [debian/rules:9: binary-arch] Error 2

Tail of log for flatpak on armhf:

PASS: tests/test-repo@system-norevokefs.wrap 14 handles version requirements
PASS: tests/test-repo@system-norevokefs.wrap 15 update metadata
PASS: tests/test-repo@system-norevokefs.wrap 16 eol build-commit-from
PASS: tests/test-repo@system-norevokefs.wrap 17 eol build-export
ERROR: tests/test-repo@system-norevokefs.wrap - too few tests run (expected 37, got 17)
ERROR: tests/test-repo@system-norevokefs.wrap - exited with status 1
make[6]: *** Deleting file 'tests/test-update-portal.sh.log'
E: Caught signal ‘Terminated’: terminating immediately
make[3]: *** [Makefile:5564: check-recursive] Terminated
make[2]: *** [Makefile:6279: check] Terminated
make[5]: *** [Makefile:5787: check-TESTS] Terminated
make[4]: *** [Makefile:6276: check-am] Terminated
make[6]: *** [Makefile:6015: tests/test-update-portal.sh.log] Terminated
make: *** [debian/rules:11: binary-arch] Terminated
make[1]: *** [debian/rules:73: override_dh_auto_test-arch] Terminated

Tail of log for ruby-eventmachine on armhf:

-------------------------------------------------------------------------------
276 tests, 3573 assertions, 0 failures, 1 errors, 0 pendings, 6 omissions, 0 notifications
99.6296% passed
-------------------------------------------------------------------------------
19.10 tests/s, 247.26 assertions/s
rake aborted!
Command failed with status (1): [ruby -w -I"tests"  "/usr/share/rubygems-integration/all/gems/rake-13.0.1/lib/rake/rake_test_loader.rb" "tests/jruby/test_jeventmachine.rb" "tests/test_attach.rb" "tests/test_basic.rb" "tests/test_channel.rb" "tests/test_completion.rb" "tests/test_connection_count.rb" "tests/test_connection_write.rb" "tests/test_defer.rb" "tests/test_deferrable.rb" "tests/test_epoll.rb" "tests/test_error_handler.rb" "tests/test_exc.rb" "tests/test_file_watch.rb" "tests/test_fork.rb" "tests/test_futures.rb" "tests/test_handler_check.rb" "tests/test_hc.rb" "tests/test_httpclient.rb" "tests/test_httpclient2.rb" "tests/test_inactivity_timeout.rb" "tests/test_io_streamer.rb" "tests/test_ipv4.rb" "tests/test_ipv6.rb" "tests/test_iterator.rb" "tests/test_kb.rb" "tests/test_keepalive.rb" "tests/test_line_protocol.rb" "tests/test_ltp.rb" "tests/test_ltp2.rb" "tests/test_many_fds.rb" "tests/test_next_tick.rb" "tests/test_object_protocol.rb" "tests/test_pause.rb" "tests/test_pending_connect_timeout.rb" "tests/test_pool.rb" "tests/test_process_watch.rb" "tests/test_processes.rb" "tests/test_proxy_connection.rb" "tests/test_pure.rb" "tests/test_queue.rb" "tests/test_resolver.rb" "tests/test_running.rb" "tests/test_sasl.rb" "tests/test_send_file.rb" "tests/test_servers.rb" "tests/test_shutdown_hooks.rb" "tests/test_smtpclient.rb" "tests/test_smtpserver.rb" "tests/test_sock_opt.rb" "tests/test_spawn.rb" "tests/test_ssl_args.rb" "tests/test_ssl_dhparam.rb" "tests/test_ssl_ecdh_curve.rb" "tests/test_ssl_extensions.rb" "tests/test_ssl_methods.rb" "tests/test_ssl_protocols.rb" "tests/test_ssl_verify.rb" "tests/test_stomp.rb" "tests/test_system.rb" "tests/test_threaded_resource.rb" "tests/test_tick_loop.rb" "tests/test_timers.rb" "tests/test_ud.rb" "tests/test_unbind_reason.rb" -v]
/usr/share/rubygems-integration/all/gems/rake-13.0.1/exe/rake:27:in `<top (required)>'
Tasks: TOP => default
(See full trace by running task with --trace)
ERROR: Test "ruby2.7" failed. Exiting.
dh_auto_install: error: dh_ruby --install /<<BUILDDIR>>/ruby-eventmachine-1.3\~pre20190820-g10fb0c4/debian/ruby-eventmachine returned exit code 1
make[1]: *** [debian/rules:13: override_dh_auto_install] Error 25
make[1]: Leaving directory '/<<PKGBUILDDIR>>'
make: *** [debian/rules:6: binary-arch] Error 2

Tail of log for boinc on armhf:

/* confdefs.h */
#define PACKAGE_NAME "BOINC"
#define PACKAGE_TARNAME "boinc"
#define PACKAGE_VERSION "7.16.11"
#define PACKAGE_STRING "BOINC 7.16.11"
#define PACKAGE_BUGREPORT ""
#define PACKAGE_URL ""
#define PACKAGE "boinc"
#define VERSION "7.16.11"

configure: exit 77
dh_auto_configure: error: ./configure --build=arm-linux-gnueabihf --prefix=/usr --includedir=\${prefix}/include --mandir=\${prefix}/share/man --infodir=\${prefix}/share/info --sysconfdir=/etc --localstatedir=/var --disable-option-checking --disable-silent-rules --libdir=\${prefix}/lib/arm-linux-gnueabihf --runstatedir=/run --disable-maintainer-mode --disable-dependency-tracking --build arm-linux-gnueabihf --prefix=/usr --bindir=/usr/bin --localstatedir=/var/lib --enable-client --enable-manager --enable-dynamic-client-linkage --disable-fcgi --enable-libraries --enable-unicode --enable-shared --enable-static --enable-dynamic-client-linkage --with-ssl --with-x "CFLAGS=-g -O2 -fdebug-prefix-map=/<<BUILDDIR>>/boinc-7.16.15+dfsg.is.7.16.11+dfsg=. -fstack-protector-strong -Wformat -Werror=format-security -Wall -O3 -funroll-loops -fforce-addr -ffast-math" returned exit code 77
make[1]: *** [debian/rules:261: override_dh_auto_configure-arch] Error 25
make[1]: Leaving directory '/<<BUILDDIR>>/boinc-7.16.15+dfsg.is.7.16.11+dfsg'
make: *** [debian/rules:201: binary-arch] Error 2

Tail of log for fakechroot on armhf:

Test Summary Report
-------------------
t/fts.t                   (Wstat: 256 Tests: 40 Failed: 2)
  Failed tests:  39-40
  Non-zero exit status: 1
Files=35, Tests=856, 106 wallclock secs ( 2.01 usr  0.33 sys + 58.59 cusr 114.46 csys = 175.39 CPU)
Result: FAIL
make[3]: *** [Makefile:1325: prove] Error 1
make[3]: Leaving directory '/<<PKGBUILDDIR>>/test'
make[2]: *** [Makefile:1328: test] Error 2
make[2]: Leaving directory '/<<PKGBUILDDIR>>/test'
make[1]: *** [Makefile:864: test] Error 2
make[1]: Leaving directory '/<<PKGBUILDDIR>>'
dh_auto_test: error: make -j4 test VERBOSE=1 returned exit code 2
make: *** [debian/rules:11: build-arch] Error 25

Tail of log for ostree on armhf:

Please report to walters@verbum.org
============================================================================
make[6]: *** [Makefile:7773: test-suite.log] Error 1
make[6]: Leaving directory '/<<PKGBUILDDIR>>'
make[5]: *** [Makefile:7881: check-TESTS] Error 2
make[5]: Leaving directory '/<<PKGBUILDDIR>>'
make[4]: *** [Makefile:8991: check-am] Error 2
make[4]: Leaving directory '/<<PKGBUILDDIR>>'
make[3]: *** [Makefile:7658: check-recursive] Error 1
make[3]: Leaving directory '/<<PKGBUILDDIR>>'
make[2]: *** [Makefile:8994: check] Error 2
make[2]: Leaving directory '/<<PKGBUILDDIR>>'
make[1]: *** [debian/rules:48: override_dh_auto_test-arch] Error 1
make[1]: Leaving directory '/<<PKGBUILDDIR>>'
make: *** [debian/rules:8: binary-arch] Error 2

Tail of log for fflas-ffpack on armhf:

make[5]: *** Deleting file 'test-fsytrf.log'
make[5]: *** [Makefile:1972: test-fsytrf.log] Terminated
make[4]: *** wait: No child processes.  Stop.
make[4]: *** Waiting for unfinished jobs....
make[4]: *** wait: No child processes.  Stop.
make[2]: *** wait: No child processes.  Stop.
make[2]: *** Waiting for unfinished jobs....
make[2]: *** wait: No child processes.  Stop.
E: Caught signal ‘Terminated’: terminating immediately
make[1]: *** wait: No child processes.  Stop.
make[1]: *** Waiting for unfinished jobs....
make[1]: *** wait: No child processes.  Stop.
make[3]: *** [Makefile:2171: check-am] Error 2
Terminated
make: *** [debian/rules:42: binary-arch] Terminated

Tail of log for pbbam on armhf:

/usr/include/c++/10/bits/vector.tcc:121:21: note: parameter passing for argument of type ‘__gnu_cxx::__normal_iterator<PacBio::CCS::internal::PbiFieldBlock*, std::vector<PacBio::CCS::internal::PbiFieldBlock> >’ changed in GCC 7.1
  121 |    _M_realloc_insert(end(), std::forward<_Args>(__args)...);
      |    ~~~~~~~~~~~~~~~~~^~~~~~~~~~~~~~~~~~~~~~~~~~~~~~~~~~~~~~~
In file included from /usr/include/c++/10/vector:67,
                 from /usr/include/pbcopper/data/Frames.h:10,
                 from ../include/pbbam/ccs/CCSRecord.h:9,
                 from ../include/pbbam/ccs/CCSPbiBuilder.h:11,
                 from ../src/ccs/CCSPbiBuilder.cpp:9:
/usr/include/c++/10/bits/stl_vector.h: In member function ‘void PacBio::CCS::CCSPbiBuilder::AddRecord(const PacBio::CCS::CCSRecord&)’:
/usr/include/c++/10/bits/stl_vector.h:1198:21: note: parameter passing for argument of type ‘__gnu_cxx::__normal_iterator<long long unsigned int*, std::vector<long long unsigned int, std::allocator<long long unsigned int> > >’ changed in GCC 7.1
 1198 |    _M_realloc_insert(end(), __x);
      |    ~~~~~~~~~~~~~~~~~^~~~~~~~~~~~
ninja: build stopped: subcommand failed.
dh_auto_build: error: cd obj-arm-linux-gnueabihf && LC_ALL=C.UTF-8 ninja -j4 -v returned exit code 1
make: *** [debian/rules:13: binary-arch] Error 25

Tail of log for siridb-server on armhf:

==16259== 
==16259== Use of uninitialised value of size 4
==16259==    at 0x497EC00: free_mem (in /lib/arm-linux-gnueabihf/libc-2.31.so)
==16259== 
==16259== Conditional jump or move depends on uninitialised value(s)
==16259==    at 0x497EC78: free_mem (in /lib/arm-linux-gnueabihf/libc-2.31.so)
==16259== 
==16259== Use of uninitialised value of size 4
==16259==    at 0x497EB24: free_slotinfo (in /lib/arm-linux-gnueabihf/libc-2.31.so)
==16259== 
make[2]: *** [makefile:86: test] Error 14
make[2]: Leaving directory '/<<PKGBUILDDIR>>/Release'
make[1]: *** [debian/rules:18: override_dh_auto_test] Error 2
make[1]: Leaving directory '/<<PKGBUILDDIR>>'
make: *** [debian/rules:6: binary-arch] Error 2

Tail of log for pyzmq on armhf:

zmq/tests/asyncio/test_asyncio.py::TestAsyncIOSocket::test_recv_string PASSED [ 95%]
zmq/tests/asyncio/test_asyncio.py::TestAsyncIOSocket::test_recv_timeout PASSED [ 96%]
zmq/tests/asyncio/test_asyncio.py::TestAsyncIOSocket::test_send_timeout PASSED [ 96%]
zmq/tests/asyncio/test_asyncio.py::TestAsyncIOSocket::test_shadow PASSED [ 96%]
zmq/tests/asyncio/test_asyncio.py::TestAsyncIOSocket::test_socket_class PASSED [ 97%]
zmq/tests/asyncio/test_asyncio.py::TestAsyncioAuthentication::test_blacklist PASSED [ 97%]
zmq/tests/asyncio/test_asyncio.py::TestAsyncioAuthentication::test_curve PASSED [ 98%]
zmq/tests/asyncio/test_asyncio.py::TestAsyncioAuthentication::test_curve_callback PASSED [ 98%]
zmq/tests/asyncio/test_asyncio.py::TestAsyncioAuthentication::test_curve_user_id PASSED [ 98%]
zmq/tests/asyncio/test_asyncio.py::TestAsyncioAuthentication::test_null PASSED [ 99%]
zmq/tests/asyncio/test_asyncio.py::TestAsyncioAuthentication::test_plain 	rm -fr -- /tmp/dh-xdg-rundir-JVQIE5Vn
SCALAR(0x1d98e98)make: *** wait: No child processes.  Stop.
make: *** Waiting for unfinished jobs....
make: *** wait: No child processes.  Stop.
make[1]: *** [debian/rules:36: override_dh_auto_test] Error 4

Dependency installability problem for gnuradio on armhf:

Installability of build dependencies not tested yet

Tail of log for git-annex on armhf:

Assistant/WebApp/Configurators/Edit.hs:110:83: error:
    * Couldn't match expected type `UUID'
                  with actual type `Git.ConfigKey'
    * In the first argument of `Git.fromConfigKey', namely
        `remotefetch'
      In the first argument of `Param', namely
        `(Git.fromConfigKey remotefetch)'
      In the expression: Param (Git.fromConfigKey remotefetch)
    |
110 |                                         [Param "config", Param (Git.fromConfigKey remotefetch), Param ""]
    |                                                                                   ^^^^^^^^^^^
make[1]: *** [Makefile:56: git-annex] Error 1
make[1]: Leaving directory '/<<PKGBUILDDIR>>'
dh_auto_build: error: make -j1 returned exit code 2
make: *** [debian/rules:31: build-arch] Error 25

Tail of log for tor on armhf:

util/strmisc: OK
util/parse_integer: OK
util/pow2: OK
util/compress/zlib: OK
util/compress/gzip: OK
util/compress/lzma: OK
util/compress/zstd: 
============================================================ T= 1600410676
Tor 0.4.4.5 died: Caught signal 7
./src/test/test(+0x771ba4)[0x12e9ba4]
/usr/lib/arm-linux-gnueabihf/libzstd.so.1(+0x35118)[0xf78e8118]
make[1]: *** [Makefile:24648: test] Aborted (core dumped)
make[1]: Leaving directory '/<<PKGBUILDDIR>>/build'
dh_auto_test: error: cd build && make -j4 test VERBOSE=1 returned exit code 2
make: *** [debian/rules:23: build-arch] Error 25

Tail of log for rauc on armhf:

# XFAIL: 0
# FAIL:  2
# XPASS: 0
# ERROR: 1
============================================================================
See ./test-suite.log
Please report to rauc@pengutronix.de
============================================================================
make[4]: *** [Makefile:1787: test-suite.log] Error 1
make[3]: *** [Makefile:1895: check-TESTS] Error 2
make[2]: *** [Makefile:2117: check-am] Error 2
make[1]: *** [Makefile:2119: check] Error 2
make[1]: Leaving directory '/<<PKGBUILDDIR>>'
dh_auto_test: error: make -j4 check VERBOSE=1 returned exit code 2
make: *** [debian/rules:7: binary-arch] Error 25