Raspbian Package Auto-Building

Buildd status for fermi-lite (bullseye-staging)

Debian PTSTrackerChangelogBugspackages.d.obuildd.d.o

Package(s): Suite:
Compact mode Co-maintainers

ArchitectureVersionStatusForBuilddStateMiscLogs
Buildd exposure stats armhf  0.1-13Build-Attempted73d 20h 21mtestwandboardout-of-datemisc:optionalold | all (5)

Tail of log for fermi-lite on armhf:

ar: `u' modifier ignored since `D' is the default (see `U')
cc -Wl,-z,relro -Wl,-z,now -g -O2 -fdebug-prefix-map=/<<PKGBUILDDIR>>=. -fstack-protector-strong -Wformat -Werror=format-security -DSIMDE_ENABLE_OPENMP -fopenmp-simd -O3 -g -Wall -O2 -fPIC   libfml.a example.o -o fml-asm -L. -lfml -lm -lz -lpthread
/usr/bin/ld: ./libfml.a(unitig.o): in function `set_bit':
./unitig.c:74: undefined reference to `__atomic_fetch_or_8'
/usr/bin/ld: ./unitig.c:74: undefined reference to `__atomic_fetch_or_8'
/usr/bin/ld: ./unitig.c:74: undefined reference to `__atomic_fetch_or_8'
/usr/bin/ld: ./unitig.c:74: undefined reference to `__atomic_fetch_or_8'
/usr/bin/ld: ./unitig.c:74: undefined reference to `__atomic_fetch_or_8'
/usr/bin/ld: ./libfml.a(unitig.o):./unitig.c:74: more undefined references to `__atomic_fetch_or_8' follow
collect2: error: ld returned 1 exit status
make[1]: *** [Makefile:18: fml-asm] Error 1
make[1]: *** Waiting for unfinished jobs....
make[1]: Leaving directory '/<<PKGBUILDDIR>>'
dh_auto_build: error: make -j4 "INSTALL=install --strip-program=true" returned exit code 2
make: *** [debian/rules:12: binary-arch] Error 25