Raspbian Package Auto-Building

Buildd status for fakechroot (stretch-staging)

Debian PTSTrackerChangelogBugspackages.d.obuildd.d.o

Package(s): Suite:
Compact mode Co-maintainers

ArchitectureVersionStatusForBuilddStateMiscLogs
Buildd exposure stats armhf  2.19-3Build-Attempted901d 4h 8mbm-wb-03out-of-dateutils:sourceold | all (6)

Tail of log for fakechroot on armhf:

  Non-zero exit status: 1
Files=35, Tests=857, 102 wallclock secs ( 2.02 usr  0.30 sys + 55.94 cusr 118.84 csys = 177.10 CPU)
Result: FAIL
Makefile:1322: recipe for target 'prove' failed
make[3]: *** [prove] Error 1
make[3]: Leaving directory '/<<PKGBUILDDIR>>/test'
Makefile:1325: recipe for target 'test' failed
make[2]: *** [test] Error 2
make[2]: Leaving directory '/<<PKGBUILDDIR>>/test'
Makefile:855: recipe for target 'test' failed
make[1]: *** [test] Error 2
make[1]: Leaving directory '/<<PKGBUILDDIR>>'
dh_auto_test: make -j4 test VERBOSE=1 returned exit code 2
debian/rules:11: recipe for target 'build-arch' failed
make: *** [build-arch] Error 2