Raspbian Package Auto-Building

Buildd status for fakechroot (bullseye-staging)

Debian PTSTrackerChangelogBugspackages.d.obuildd.d.o

Package(s): Suite:
Compact mode Co-maintainers

ArchitectureVersionStatusForBuilddStateMiscLogs
Buildd exposure stats armhf  2.19-3.3Build-Attempted45d 17h 23mbm-wb-04out-of-dateutils:sourceold | all (1)

Tail of log for fakechroot on armhf:

Test Summary Report
-------------------
t/fts.t                   (Wstat: 256 Tests: 40 Failed: 2)
  Failed tests:  39-40
  Non-zero exit status: 1
Files=35, Tests=856, 106 wallclock secs ( 2.01 usr  0.33 sys + 58.59 cusr 114.46 csys = 175.39 CPU)
Result: FAIL
make[3]: *** [Makefile:1325: prove] Error 1
make[3]: Leaving directory '/<<PKGBUILDDIR>>/test'
make[2]: *** [Makefile:1328: test] Error 2
make[2]: Leaving directory '/<<PKGBUILDDIR>>/test'
make[1]: *** [Makefile:864: test] Error 2
make[1]: Leaving directory '/<<PKGBUILDDIR>>'
dh_auto_test: error: make -j4 test VERBOSE=1 returned exit code 2
make: *** [debian/rules:11: build-arch] Error 25