Raspbian Package Auto-Building

Buildd status for fairy-stockfish (bullseye-staging)

Debian PTSTrackerChangelogBugspackages.d.obuildd.d.o

Package(s): Suite:
Compact mode Co-maintainers

ArchitectureVersionStatusForBuilddStateMiscLogs
Buildd exposure stats armhf  11.1-1Build-Attempted72d 21h 13mtestbuildduncompiledmisc:sourceold | all (2)

Tail of log for fairy-stockfish on armhf:

/usr/bin/ld: /usr/include/c++/10/bits/atomic_base.h:426: undefined reference to `__atomic_load_8'
/usr/bin/ld: /tmp/stockfish.svZ7Id.ltrans6.ltrans.o: in function `UCI::loop(int, char**)':
/usr/include/c++/10/bits/atomic_base.h:426: undefined reference to `__atomic_load_8'
/usr/bin/ld: /tmp/stockfish.svZ7Id.ltrans9.ltrans.o: in function `ThreadPool::start_thinking(Position&, std::unique_ptr<std::deque<StateInfo, std::allocator<StateInfo> >, std::default_delete<std::deque<StateInfo, std::allocator<StateInfo> > > >&, Search::LimitsType const&, bool) [clone .constprop.0]':
/usr/include/c++/10/bits/atomic_base.h:404: undefined reference to `__atomic_store_8'
/usr/bin/ld: /usr/include/c++/10/bits/atomic_base.h:404: undefined reference to `__atomic_store_8'
collect2: error: ld returned 1 exit status
make[3]: *** [Makefile:516: stockfish] Error 1
make[3]: Leaving directory '/<<PKGBUILDDIR>>/src'
make[2]: *** [Makefile:433: build] Error 2
make[2]: Leaving directory '/<<PKGBUILDDIR>>/src'
dh_auto_build: error: cd src && make -j4 build ARCH=general-32 returned exit code 2
make[1]: *** [debian/rules:105: override_dh_auto_build] Error 25
make[1]: Leaving directory '/<<PKGBUILDDIR>>'
make: *** [debian/rules:99: build-arch] Error 2