Raspbian Package Auto-Building

Buildd status for selected packages (stretch-staging)

Bugs

Package(s): Suite:
Compact mode Co-maintainers

Package armhf
Buildd exposure stats
✘ dumb-init  Build-Attempted
✘ fakechroot  Build-Attempted
✘ libgit2  Build-Attempted
✘ docker.io  Build-Attempted
✘ globus-gssapi-gsi  Build-Attempted
✘ libexplain  Build-Attempted
✘ isatapd  Build-Attempted
✘ vite  Build-Attempted
✘ idba  Build-Attempted
✘ libecap  Build-Attempted
✘ myproxy  Build-Attempted
✘ htseq  Build-Attempted
✘ openhpi  Build-Attempted
✘ nestopia  Build-Attempted
✘ sbcl  Build-Attempted
✘ gnome-control-center  Build-Attempted
✘ python-pysam  Build-Attempted
✘ openvswitch  Build-Attempted
✘ mpqc3  Build-Attempted
Package armhf
Buildd exposure stats
✘ osmose-emulator  Build-Attempted
✘ patat  Build-Attempted
✘ stopmotion  Build-Attempted
✘ trinity  Build-Attempted
✘ python-apt  Build-Attempted
✘ trilinos  Build-Attempted
✔ gfccoreBuild-Attempted
✔ libqglviewerBuild-Attempted
✔ acoveaBuild-Attempted
✔ mingw32-binutilsBuild-Attempted
✔ ocamlgslBuild-Attempted
✔ apfBuild-Attempted
✔ asterisk-chan-capiBuild-Attempted
✔ audacious-analog-vumeter-pluginBuild-Attempted
✔ bagelBuild-Attempted
✔ bio-eagleBuild-Attempted
✔ cdeBuild-Attempted
✔ binoBuild-Attempted
✔ ckBuild-Attempted
✔ consul-migrateBuild-Attempted
Package armhf
Buildd exposure stats
✔ criuBuild-Attempted
✔ djbdnsBuild-Attempted
✔ cross-binutilsBuild-Attempted
✔ cpl-plugin-xshBuild-Attempted
✔ efitoolsBuild-Attempted
✔ eclipse-titanBuild-Attempted
✔ ezquakeBuild-Attempted
✔ compizBuild-Attempted
✔ freefoamBuild-Attempted
✔ grpcBuild-Attempted
✔ haskell-cryptolBuild-Attempted
✔ formBuild-Attempted
✔ haskell-type-levelBuild-Attempted
✔ intel-processor-traceBuild-Attempted
✔ ioappsBuild-Attempted
✔ gambcBuild-Attempted
✔ jocamlBuild-Attempted
✔ libmlx5Build-Attempted
✔ ibamBuild-Attempted
✔ libnunc-stansBuild-Attempted
Package armhf
Buildd exposure stats
✔ libretro-mupen64plusBuild-Attempted
✔ libtangoBuild-Attempted
✔ listallerBuild-Attempted
✔ mdp-srcBuild-Attempted
✔ libsoundioBuild-Attempted
✔ mensisBuild-Attempted
✔ mpi-testsuiteBuild-Attempted
✔ msrtoolBuild-Attempted
✔ ne10Build-Attempted
✔ nsd3Build-Attempted
✔ numactlBuild-Attempted
✔ open-axiomBuild-Attempted
✔ openmpi1.6Build-Attempted
✔ orpieBuild-Attempted
✔ ngs-sdkBuild-Attempted
✔ percona-xtradb-cluster-galera-2.xBuild-Attempted
✔ osrmBuild-Attempted
✔ networkmanagementBuild-Attempted
✔ perftestBuild-Attempted
✔ pgloaderBuild-Attempted
Package armhf
Buildd exposure stats
✔ php-apcBuild-Attempted
✔ poclBuild-Attempted
✔ prboomBuild-Attempted
✔ pyside-mobilityBuild-Attempted
✔ qtjsbackend-opensource-srcBuild-Attempted
✔ qutecsoundBuild-Attempted
✔ rt-appBuild-Attempted
✔ pinotBuild-Attempted
✔ qstopmotionBuild-Attempted
✔ ruby2.1Build-Attempted
✔ slang-slirpBuild-Attempted
✔ sortmernaBuild-Attempted
✔ snap-alignerBuild-Attempted
✔ tlsdateBuild-Attempted
✔ ulogdBuild-Attempted
✔ varnish-agentBuild-Attempted
✔ tarantoolBuild-Attempted
✔ wiredtigerBuild-Attempted
✔ wmmailBuild-Attempted
✔ xf86-video-msmBuild-Attempted
Package armhf
Buildd exposure stats
✔ yp-toolsBuild-Attempted
✔ sdrangeloveBuild-Attempted
✔ wesnoth-1.8Build-Attempted
✔ xhprofBuild-Attempted
✔ 3dldfBuild-Attempted
✔ monavBuild-Attempted
✔ slic3r-prusaBuild-Attempted
✔ rivetBuild-Attempted
✔ coneBuild-Attempted
✔ sflphoneBuild-Attempted
✔ firefoxBuild-Attempted
✔ iceweaselBuild-Attempted
✔ tulipBuild-Attempted
✔ libsis-jhdf5-javaBuild-Attempted
✔ kritaBuild-Attempted
✔ sagemathBuild-Attempted
✘ globus-proxy-utils  Build-Attempted
✘ aeskulap  Build-Attempted
✔ librsbBuild-Attempted
✘ openjfx  Build-Attempted
Package armhf
Buildd exposure stats
✘ memcached  Build-Attempted
✘ git-annex  Build-Attempted
✘ abiword  Build-Attempted
✘ blender  Build-Attempted
✔ trafficserverBuild-Attempted
✘ ycmd  Build-Attempted
✔ nifti2dicomBuild-Attempted
✘ ceph  Build-Attempted
✔ chromium-browserBuild-Attempted
✔ golang-1.8Build-Attempted
✔ libb2Build-Attempted
✔ chromiumBuild-Attempted
✘ bind9  Build-Attempted
✘ neovim  Build-Attempted
✘ postgresql-9.6  Build-Attempted
✘ liquidsoap  Build-Attempted
✘ openldap  Build-Attempted
✔ ghostscriptInstalled

Tail of log for dumb-init on armhf:

    
        # read a line from print_signals, figure out its pid
        line = proc.stdout.readline()
        match = re.match(b'ready \(pid: ([0-9]+)\)\n', line)
>       assert match, line
E       AssertionError: 
E       assert None

tests/child_processes_test.py:95: AssertionError
==================== 2 failed, 170 passed in 23.49 seconds =====================
debian/rules:31: recipe for target 'override_dh_auto_test' failed
make[1]: *** [override_dh_auto_test] Error 1
make[1]: Leaving directory '/<<PKGBUILDDIR>>'
debian/rules:9: recipe for target 'build-arch' failed
make: *** [build-arch] Error 2

Tail of log for fakechroot on armhf:

  Non-zero exit status: 1
Files=35, Tests=857, 102 wallclock secs ( 2.02 usr  0.30 sys + 55.94 cusr 118.84 csys = 177.10 CPU)
Result: FAIL
Makefile:1322: recipe for target 'prove' failed
make[3]: *** [prove] Error 1
make[3]: Leaving directory '/<<PKGBUILDDIR>>/test'
Makefile:1325: recipe for target 'test' failed
make[2]: *** [test] Error 2
make[2]: Leaving directory '/<<PKGBUILDDIR>>/test'
Makefile:855: recipe for target 'test' failed
make[1]: *** [test] Error 2
make[1]: Leaving directory '/<<PKGBUILDDIR>>'
dh_auto_test: make -j4 test VERBOSE=1 returned exit code 2
debian/rules:11: recipe for target 'build-arch' failed
make: *** [build-arch] Error 2

Tail of log for libgit2 on armhf:

Total Test time (real) = 244.37 sec

The following tests FAILED:
	  1 - libgit2_clar (Failed)
Errors while running CTest
Makefile:108: recipe for target 'test' failed
make[2]: *** [test] Error 8
make[2]: Leaving directory '/<<BUILDDIR>>/libgit2-0.25.1+really0.24.6/build-debian-release'
dh_auto_test: make -j4 test ARGS+=-j4 returned exit code 2
debian/rules:46: recipe for target 'override_dh_auto_test' failed
make[1]: *** [override_dh_auto_test] Error 2
make[1]: Leaving directory '/<<BUILDDIR>>/libgit2-0.25.1+really0.24.6'
debian/rules:58: recipe for target 'build-arch' failed
make: *** [build-arch] Error 2

Tail of log for docker.io on armhf:

# officially supported.
#
# Try this instead: make all
#

---> Making bundle: dynbinary (in bundles/1.11.2/dynbinary)
Building: bundles/1.11.2/dynbinary/docker-1.11.2
.gopath/src/github.com/docker/libnetwork/agent.go:13:2: cannot find package "github.com/docker/go-events" in any of:
	/usr/lib/go-1.7/src/github.com/docker/go-events (from $GOROOT)
	/<<PKGBUILDDIR>>/.gopath/src/github.com/docker/go-events (from $GOPATH)
debian/rules:60: recipe for target 'override_dh_auto_build' failed
make[1]: *** [override_dh_auto_build] Error 1
make[1]: Leaving directory '/<<PKGBUILDDIR>>'
debian/rules:109: recipe for target 'build-arch' failed
make: *** [build-arch] Error 2

Tail of log for globus-gssapi-gsi on armhf:

============================================================================
Makefile:1127: recipe for target 'test-suite.log' failed
make[4]: *** [test-suite.log] Error 1
make[4]: Leaving directory '/<<PKGBUILDDIR>>/test'
Makefile:1233: recipe for target 'check-TESTS' failed
make[3]: *** [check-TESTS] Error 2
make[3]: Leaving directory '/<<PKGBUILDDIR>>/test'
Makefile:1460: recipe for target 'check-am' failed
make[2]: *** [check-am] Error 2
make[2]: Leaving directory '/<<PKGBUILDDIR>>/test'
Makefile:491: recipe for target 'check-recursive' failed
make[1]: *** [check-recursive] Error 1
make[1]: Leaving directory '/<<PKGBUILDDIR>>'
debian/rules:58: recipe for target 'build-stamp' failed
make: *** [build-stamp] Error 2

Tail of log for libexplain on armhf:

         { "FS_PROJINHERIT_FL", FS_PROJINHERIT_FL },
                                ^~~~~~~~~~~~~~~~~
libexplain/buffer/file_inode_flags.c:61:9: warning: missing initializer for field 'value' of 'explain_parse_bits_table_t {aka const struct explain_parse_bits_table_t}' [-Wmissing-field-initializers]
         { "FS_PROJINHERIT_FL", FS_PROJINHERIT_FL },
         ^
In file included from libexplain/buffer/file_inode_flags.c:25:0:
./libexplain/parse_bits.h:31:21: note: 'value' declared here
     int             value;
                     ^~~~~
Makefile:10623: recipe for target 'libexplain/buffer/file_inode_flags.lo' failed
make[1]: *** [libexplain/buffer/file_inode_flags.lo] Error 1
make[1]: Leaving directory '/<<PKGBUILDDIR>>'
dh_auto_build: make -j1 returned exit code 2
debian/rules:7: recipe for target 'build-arch' failed
make: *** [build-arch] Error 2

Tail of log for isatapd on armhf:

/usr/include/linux/if_tunnel.h:37:16: error: field 'iph' has incomplete type
  struct iphdr  iph;
                ^~~
Makefile:353: recipe for target 'tunnel.o' failed
make[3]: *** [tunnel.o] Error 1
make[3]: Leaving directory '/<<PKGBUILDDIR>>/src'
Makefile:355: recipe for target 'all-recursive' failed
make[2]: *** [all-recursive] Error 1
make[2]: Leaving directory '/<<PKGBUILDDIR>>'
Makefile:296: recipe for target 'all' failed
make[1]: *** [all] Error 2
make[1]: Leaving directory '/<<PKGBUILDDIR>>'
dh_auto_build: make -j1 returned exit code 2
debian/rules:6: recipe for target 'build-arch' failed
make: *** [build-arch] Error 2

Tail of log for vite on armhf:

src/CMakeFiles/vite.dir/build.make:1035: recipe for target 'src/CMakeFiles/vite.dir/render/render_stats_opengl.cpp.o' failed
make[4]: *** [src/CMakeFiles/vite.dir/render/render_stats_opengl.cpp.o] Error 1
make[4]: Leaving directory '/<<BUILDDIR>>/vite-1.2+svn1430/obj-arm-linux-gnueabihf'
CMakeFiles/Makefile2:121: recipe for target 'src/CMakeFiles/vite.dir/all' failed
make[3]: *** [src/CMakeFiles/vite.dir/all] Error 2
make[3]: Leaving directory '/<<BUILDDIR>>/vite-1.2+svn1430/obj-arm-linux-gnueabihf'
Makefile:152: recipe for target 'all' failed
make[2]: *** [all] Error 2
make[2]: Leaving directory '/<<BUILDDIR>>/vite-1.2+svn1430/obj-arm-linux-gnueabihf'
dh_auto_build: make -j4 returned exit code 2
debian/rules:11: recipe for target 'override_dh_auto_build' failed
make[1]: *** [override_dh_auto_build] Error 2
make[1]: Leaving directory '/<<BUILDDIR>>/vite-1.2+svn1430'
debian/rules:4: recipe for target 'build-arch' failed
make: *** [build-arch] Error 2

Tail of log for idba on armhf:

Makefile:891: recipe for target 'test-suite.log' failed
make[4]: *** [test-suite.log] Error 1
make[4]: Leaving directory '/<<PKGBUILDDIR>>/test'
Makefile:997: recipe for target 'check-TESTS' failed
make[3]: *** [check-TESTS] Error 2
make[3]: Leaving directory '/<<PKGBUILDDIR>>/test'
Makefile:1147: recipe for target 'check-am' failed
make[2]: *** [check-am] Error 2
make[2]: Leaving directory '/<<PKGBUILDDIR>>/test'
Makefile:357: recipe for target 'check-recursive' failed
make[1]: *** [check-recursive] Error 1
make[1]: Leaving directory '/<<PKGBUILDDIR>>'
dh_auto_test: make -j4 check VERBOSE=1 returned exit code 2
debian/rules:10: recipe for target 'build-arch' failed
make: *** [build-arch] Error 2

Tail of log for libecap on armhf:

+#MISSING: 1.0.1-3.2# (arch=!armel)_ZTSNSt3tr121_Sp_counted_base_implIPN7libecap7adapter7ServiceENS_11_Sp_deleterIS3_EELN9__gnu_cxx12_Lock_policyE2EEE@Base 1.0.1
  _ZTVN7libecap13TextExceptionE@Base 1.0.1
  _ZTVN7libecap20StdStringAreaDetailsE@Base 1.0.1
  _ZTVN7libecap7MessageE@Base 1.0.1
  _ZTVN7libecap7adapter7ServiceE@Base 1.0.1
  _ZTVN7libecap7adapter7XactionE@Base 1.0.1
- (arch=!armel)_ZTVNSt3tr121_Sp_counted_base_implIPN7libecap20StdStringAreaDetailsENS_11_Sp_deleterIS2_EELN9__gnu_cxx12_Lock_policyE2EEE@Base 1.0.1
- (arch=!armel)_ZTVNSt3tr121_Sp_counted_base_implIPN7libecap7adapter7ServiceENS_11_Sp_deleterIS3_EELN9__gnu_cxx12_Lock_policyE2EEE@Base 1.0.1
+ _ZTVNSt3tr121_Sp_counted_base_implIPN7libecap20StdStringAreaDetailsENS_11_Sp_deleterIS2_EELN9__gnu_cxx12_Lock_policyE1EEE@Base 1.0.1-3.2
+#MISSING: 1.0.1-3.2# (arch=!armel)_ZTVNSt3tr121_Sp_counted_base_implIPN7libecap20StdStringAreaDetailsENS_11_Sp_deleterIS2_EELN9__gnu_cxx12_Lock_policyE2EEE@Base 1.0.1
+ _ZTVNSt3tr121_Sp_counted_base_implIPN7libecap7adapter7ServiceENS_11_Sp_deleterIS3_EELN9__gnu_cxx12_Lock_policyE1EEE@Base 1.0.1-3.2
+#MISSING: 1.0.1-3.2# (arch=!armel)_ZTVNSt3tr121_Sp_counted_base_implIPN7libecap7adapter7ServiceENS_11_Sp_deleterIS3_EELN9__gnu_cxx12_Lock_policyE2EEE@Base 1.0.1
dh_makeshlibs: failing due to earlier errors
/usr/share/cdbs/1/rules/debhelper.mk:312: recipe for target 'binary-fixup/libecap3' failed
make: *** [binary-fixup/libecap3] Error 255

Tail of log for myproxy on armhf:

============================================================================
Makefile:1495: recipe for target 'test-suite.log' failed
make[4]: *** [test-suite.log] Error 1
make[4]: Leaving directory '/<<PKGBUILDDIR>>'
Makefile:1601: recipe for target 'check-TESTS' failed
make[3]: *** [check-TESTS] Error 2
make[3]: Leaving directory '/<<PKGBUILDDIR>>'
Makefile:1832: recipe for target 'check-am' failed
make[2]: *** [check-am] Error 2
make[2]: Leaving directory '/<<PKGBUILDDIR>>'
Makefile:1381: recipe for target 'check-recursive' failed
make[1]: *** [check-recursive] Error 1
make[1]: Leaving directory '/<<PKGBUILDDIR>>'
debian/rules:60: recipe for target 'build-stamp' failed
make: *** [build-stamp] Error 2

Tail of log for htseq on armhf:

    array([0, 0, 0, ..., 0, 0, 0], dtype=int32)
Got:
    array([0, 0, 0, ..., 0, 0, 0])
**********************************************************************
1 items had failures:
   1 of  37 in tss.rst
***Test Failed*** 1 failures.
1 of 37 tests failed.

Not all tests passed.
debian/rules:19: recipe for target 'test-python2.7' failed
make[1]: *** [test-python2.7] Error 1
make[1]: Leaving directory '/<<PKGBUILDDIR>>'
debian/rules:15: recipe for target 'build-arch' failed
make: *** [build-arch] Error 2

Tail of log for openhpi on armhf:

make[3]: Entering directory '/<<PKGBUILDDIR>>/snmp'
/bin/bash ../libtool  --tag=CC   --mode=compile arm-linux-gnueabihf-gcc -DHAVE_CONFIG_H -I. -I..  -DG_LOG_DOMAIN=\"snmp\" -I../include -I../utils -I../utils -I../clients -Wdate-time -D_FORTIFY_SOURCE=2 -DNETSNMP_ENABLE_IPV6 -fno-strict-aliasing -g  -fdebug-prefix-map=/build/net-snmp -fstack-protector-strong -Wformat -Werror=format-security -DNETSNMP_USE_INLINE -Ulinux -Dlinux=linux -D_REENTRANT -D_GNU_SOURCE -DDEBIAN -fwrapv -fno-strict-aliasing -pipe -I/usr/local/include -D_LARGEFILE_SOURCE -D_FILE_OFFSET_BITS=64 -I/usr/lib/arm-linux-gnueabihf/perl/5.24/CORE -Wdate-time -D_FORTIFY_SOURCE=2 -I. -I/usr/include -g -O2 -I/usr/include/glib-2.0 -I/usr/lib/arm-linux-gnueabihf/glib-2.0/include         -Wall         -Wmissing-prototypes         -Wmissing-declarations         -Wstrict-prototypes         -Wpointer-arith         -Wformat=2         -Wformat-security         -Wformat-nonliteral         -Wno-format-y2k         -Wcast-qual         -Wcast-align         -Wno-strict-aliasing 	-fno-strict-aliasing         -Wno-unused-value  -D_GNU_SOURCE -D_REENTRANT -fexceptions -MT snmp_utils.lo -MD -MP -MF .deps/snmp_utils.Tpo -c -o snmp_utils.lo snmp_utils.c
libtool: compile:  arm-linux-gnueabihf-gcc -DHAVE_CONFIG_H -I. -I.. -DG_LOG_DOMAIN=\"snmp\" -I../include -I../utils -I../utils -I../clients -Wdate-time -D_FORTIFY_SOURCE=2 -DNETSNMP_ENABLE_IPV6 -fno-strict-aliasing -g -fdebug-prefix-map=/build/net-snmp -fstack-protector-strong -Wformat -Werror=format-security -DNETSNMP_USE_INLINE -Ulinux -Dlinux=linux -D_REENTRANT -D_GNU_SOURCE -DDEBIAN -fwrapv -fno-strict-aliasing -pipe -I/usr/local/include -D_LARGEFILE_SOURCE -D_FILE_OFFSET_BITS=64 -I/usr/lib/arm-linux-gnueabihf/perl/5.24/CORE -Wdate-time -D_FORTIFY_SOURCE=2 -I. -I/usr/include -g -O2 -I/usr/include/glib-2.0 -I/usr/lib/arm-linux-gnueabihf/glib-2.0/include -Wall -Wmissing-prototypes -Wmissing-declarations -Wstrict-prototypes -Wpointer-arith -Wformat=2 -Wformat-security -Wformat-nonliteral -Wno-format-y2k -Wcast-qual -Wcast-align -Wno-strict-aliasing -fno-strict-aliasing -Wno-unused-value -D_GNU_SOURCE -D_REENTRANT -fexceptions -MT snmp_utils.lo -MD -MP -MF .deps/snmp_utils.Tpo -c snmp_utils.c  -fPIC -DPIC -o .libs/snmp_utils.o
cc1: error: invalid argument '/build/net-snmp' to -fdebug-prefix-map
Makefile:497: recipe for target 'snmp_utils.lo' failed
make[3]: *** [snmp_utils.lo] Error 1
make[3]: Leaving directory '/<<PKGBUILDDIR>>/snmp'
Makefile:647: recipe for target 'all-recursive' failed
make[2]: *** [all-recursive] Error 1
make[2]: Leaving directory '/<<PKGBUILDDIR>>'
Makefile:531: recipe for target 'all' failed
make[1]: *** [all] Error 2
make[1]: Leaving directory '/<<PKGBUILDDIR>>'
debian/rules:60: recipe for target 'build-stamp' failed
make: *** [build-stamp] Error 2

Tail of log for nestopia on armhf:

g++ -g -O2 -fdebug-prefix-map=/<<PKGBUILDDIR>>=. -specs=/usr/share/dpkg/no-pie-compile.specs -fstack-protector-strong -Wformat -Werror=format-security -fpermissive -Isource -Wno-write-strings -Wno-deprecated-declarations -DDATADIR=\"/usr/share/nestopia\" -D_GTK -g -O2 -fdebug-prefix-map=/<<PKGBUILDDIR>>=. -specs=/usr/share/dpkg/no-pie-compile.specs -fstack-protector-strong -Wformat -Werror=format-security -fpermissive -I/usr/include/SDL2 -D_REENTRANT -pthread -I/usr/include/gtk-3.0 -I/usr/include/at-spi2-atk/2.0 -I/usr/include/at-spi-2.0 -I/usr/include/dbus-1.0 -I/usr/lib/arm-linux-gnueabihf/dbus-1.0/include -I/usr/include/gtk-3.0 -I/usr/include/gio-unix-2.0/ -I/usr/include/cairo -I/usr/include/pango-1.0 -I/usr/include/harfbuzz -I/usr/include/pango-1.0 -I/usr/include/atk-1.0 -I/usr/include/cairo -I/usr/include/pixman-1 -I/usr/include/freetype2 -I/usr/include/libpng16 -I/usr/include/gdk-pixbuf-2.0 -I/usr/include/libpng16 -I/usr/include/glib-2.0 -I/usr/lib/arm-linux-gnueabihf/glib-2.0/include -c source/unix/gtkui/gtkui.cpp -o objs/unix/gtkui/gtkui.o
In file included from source/unix/gtkui/gtkui.cpp:31:0:
source/unix/gtkui/gtkui.h:11:28: fatal error: gdk/gdkwayland.h: No such file or directory
 #include <gdk/gdkwayland.h>
                            ^
compilation terminated.
Makefile:381: recipe for target 'objs/unix/gtkui/gtkui.o' failed
make[2]: *** [objs/unix/gtkui/gtkui.o] Error 1
make[2]: Leaving directory '/<<PKGBUILDDIR>>'
dh_auto_build: make -j1 returned exit code 2
debian/rules:27: recipe for target 'override_dh_auto_build' failed
make[1]: *** [override_dh_auto_build] Error 2
make[1]: Leaving directory '/<<PKGBUILDDIR>>'
debian/rules:24: recipe for target 'build-arch' failed
make: *** [build-arch] Error 2

Tail of log for sbcl on armhf:

Memory fault at 0x4 (pc=0x51412cd0, sp=(nil))
The integrity of this image is possibly compromised.
Exiting.
Makefile:5: recipe for target 'test' failed
make[1]: *** [test] Error 1
make[1]: Leaving directory '/<<PKGBUILDDIR>>/contrib/sb-sprof'

WARNING! Some of the contrib modules did not build successfully or pass
their self-tests. Failed contribs:"
  sb-sprof
Command exited with non-zero status 1
152.40user 3.23system 2:35.88elapsed 99%CPU (0avgtext+0avgdata 112100maxresident)k
216inputs+32696outputs (2major+261790minor)pagefaults 0swaps
debian/rules:45: recipe for target 'build-arch-stamp' failed
make: *** [build-arch-stamp] Error 1

Tail of log for gnome-control-center on armhf:

Makefile:1170: recipe for target 'all-recursive' failed
make[4]: *** [all-recursive] Error 1
make[4]: Leaving directory '/<<PKGBUILDDIR>>/shell'
Makefile:720: recipe for target 'all' failed
make[3]: *** [all] Error 2
make[3]: Leaving directory '/<<PKGBUILDDIR>>/shell'
Makefile:542: recipe for target 'all-recursive' failed
make[2]: *** [all-recursive] Error 1
make[2]: Leaving directory '/<<PKGBUILDDIR>>'
Makefile:474: recipe for target 'all' failed
make[1]: *** [all] Error 2
make[1]: Leaving directory '/<<PKGBUILDDIR>>'
dh_auto_build: make -j4 returned exit code 2
debian/rules:9: recipe for target 'build-arch' failed
make: *** [build-arch] Error 2

Tail of log for python-pysam on armhf:

testARquery (AlignmentFile_test.BasicTestBAMFromFilename) ... ok
testARrname (AlignmentFile_test.BasicTestBAMFromFilename) ... ok
testARseq (AlignmentFile_test.BasicTestBAMFromFilename) ... ok
testOpt (AlignmentFile_test.BasicTestBAMFromFilename) ... ok
testPairedBools (AlignmentFile_test.BasicTestBAMFromFilename) ... ok
testPresentOptionalFields (AlignmentFile_test.BasicTestBAMFromFilename) ... ok
testTags (AlignmentFile_test.BasicTestBAMFromFilename) ... ok
testARQueryLength (AlignmentFile_test.BasicTestCRAMFromFetch) ... Segmentation fault
E: pybuild pybuild:283: test: plugin distutils failed with: exit code=139: cd /<<BUILDDIR>>/python-pysam-0.10.0+ds/.pybuild/pythonX.Y_2.7/build; python2.7 -m nose 
dh_auto_test: pybuild --test -i python{version} -p 2.7 returned exit code 13
debian/rules:38: recipe for target 'override_dh_auto_test' failed
make[1]: *** [override_dh_auto_test] Error 25
make[1]: Leaving directory '/<<BUILDDIR>>/python-pysam-0.10.0+ds'
debian/rules:32: recipe for target 'build-arch' failed
make: *** [build-arch] Error 2

Tail of log for openvswitch on armhf:

| #define ATOMIC_ALWAYS_LOCK_FREE_4B 1
| #define ATOMIC_ALWAYS_LOCK_FREE_8B 1
| #define HAVE_GLIBC_PTHREAD_SETNAME_NP 1
| #define HAVE_POSIX_MEMALIGN 1
| #define HAVE_STDIO_H 1
| #define HAVE_STRING_H 1
| #define HAVE_PRAGMA_MESSAGE 1
| 
| configure: exit 0

debian/rules:35: recipe for target 'override_dh_auto_test' failed
make[1]: *** [override_dh_auto_test] Error 1
make[1]: Leaving directory '/<<BUILDDIR>>/openvswitch-2.6.2~pre+git20161223'
debian/rules:23: recipe for target 'build-arch' failed
make: *** [build-arch] Error 2

Tail of log for mpqc3 on armhf:

[ 70%] Building CXX object src/lib/chemistry/qc/mbptr12/CMakeFiles/mbptr12.dir/twobody_intermediates_ta.cc.o
cd "/<<PKGBUILDDIR>>/obj-arm-linux-gnueabihf/src/lib/chemistry/qc/mbptr12" && /usr/bin/c++   -DHAVE_CONFIG_H -DMPQC_NEW_FEATURES -DMPQC_R12 -I"/<<PKGBUILDDIR>>/obj-arm-linux-gnueabihf/src/lib" -I"/<<PKGBUILDDIR>>/src/lib" -I"/<<PKGBUILDDIR>>/include" -I/usr/include/mpich -I/usr/include/eigen3 -I/usr/include/openbabel-2.0 -I/usr/include/libint2 -I/usr/include/TiledArray/external  -std=c++11 -g -O2 -std=c++11   -o CMakeFiles/mbptr12.dir/twobody_intermediates_ta.cc.o -c "/<<PKGBUILDDIR>>/src/lib/chemistry/qc/mbptr12/twobody_intermediates_ta.cc"
virtual memory exhausted: Cannot allocate memory
src/lib/chemistry/qc/mbptr12/CMakeFiles/mbptr12.dir/build.make:1049: recipe for target 'src/lib/chemistry/qc/mbptr12/CMakeFiles/mbptr12.dir/twobody_intermediates_ta.cc.o' failed
make[3]: *** [src/lib/chemistry/qc/mbptr12/CMakeFiles/mbptr12.dir/twobody_intermediates_ta.cc.o] Error 1
make[3]: Leaving directory '/<<PKGBUILDDIR>>/obj-arm-linux-gnueabihf'
CMakeFiles/Makefile2:3056: recipe for target 'src/lib/chemistry/qc/mbptr12/CMakeFiles/mbptr12.dir/all' failed
make[2]: *** [src/lib/chemistry/qc/mbptr12/CMakeFiles/mbptr12.dir/all] Error 2
make[2]: Leaving directory '/<<PKGBUILDDIR>>/obj-arm-linux-gnueabihf'
Makefile:141: recipe for target 'all' failed
make[1]: *** [all] Error 2
make[1]: Leaving directory '/<<PKGBUILDDIR>>/obj-arm-linux-gnueabihf'
dh_auto_build: make -j1 returned exit code 2
debian/rules:8: recipe for target 'build-arch' failed
make: *** [build-arch] Error 2

Tail of log for osmose-emulator on armhf:

QGLImage.cpp:174:17: error: 'glLoadIdentity' was not declared in this scope
  glLoadIdentity();
                 ^
QGLImage.cpp:175:43: error: 'glOrtho' was not declared in this scope
  glOrtho(0.0f,width,height,0.0f,-1.0f,1.0f);
                                           ^
QGLImage.cpp:176:15: error: 'GL_MODELVIEW' was not declared in this scope
  glMatrixMode(GL_MODELVIEW);
               ^~~~~~~~~~~~
Makefile:663: recipe for target 'QGLImage.o' failed
make[1]: *** [QGLImage.o] Error 1
make[1]: Leaving directory '/<<PKGBUILDDIR>>'
dh_auto_build: make -j1 returned exit code 2
debian/rules:8: recipe for target 'build-arch' failed
make: *** [build-arch] Error 25

Tail of log for patat on armhf:

patat:             Install signal handlers (default: yes)
patat:   -e<n>     Maximum number of outstanding local sparks (default: 4096)
patat:   -xq       The allocation limit given to a thread after it receives
patat:             an AllocationLimitExceeded exception. (default: 100k)
patat: 
patat: RTS options may also be specified using the GHCRTS environment variable.
patat: 
patat: Other RTS options may be available for programs compiled a different way.
patat: The GHC User's Guide has full details.
patat: 
debian/rules:21: recipe for target 'override_dh_auto_test' failed
make[1]: *** [override_dh_auto_test] Error 1
make[1]: Leaving directory '/<<PKGBUILDDIR>>'
debian/rules:6: recipe for target 'build-arch' failed
make: *** [build-arch] Error 2

Tail of log for stopmotion on armhf:

src/technical/audio/ossdriver.cpp:123:2: error: narrowing conversion of '3221508098u' from 'unsigned int' to 'int' inside { } [-Wnarrowing]
src/technical/audio/ossdriver.cpp: In member function 'virtual void OSSDriver::play()':
src/technical/audio/ossdriver.cpp:80:41: warning: ignoring return value of 'ssize_t write(int, const void*, size_t)', declared with attribute warn_unused_result [-Wunused-result]
     write(audioFD, audioBuffer, written);
                                         ^
Makefile.Release:995: recipe for target 'build/release/ossdriver.o' failed
make[2]: *** [build/release/ossdriver.o] Error 1
make[2]: *** Waiting for unfinished jobs....
make[2]: Leaving directory '/<<PKGBUILDDIR>>'
Makefile:34: recipe for target 'release' failed
make[1]: *** [release] Error 2
make[1]: Leaving directory '/<<PKGBUILDDIR>>'
dh_auto_build: make -j4 returned exit code 2
debian/rules:7: recipe for target 'build-arch' failed
make: *** [build-arch] Error 25

Tail of log for trinity on armhf:

    ^~~~~~~~~~~~~~~~~~~~~~~~
fds/bpf.c:67:4: error: 'BPF_MAP_TYPE_PERCPU_ARRAY' undeclared here (not in a function)
  { BPF_MAP_TYPE_PERCPU_ARRAY, sizeof(u32), sizeof(u64), 100, 0, "percpu array" },
    ^~~~~~~~~~~~~~~~~~~~~~~~~
fds/bpf.c:68:4: error: 'BPF_MAP_TYPE_STACK_TRACE' undeclared here (not in a function)
  { BPF_MAP_TYPE_STACK_TRACE, sizeof(u32), sizeof(u64), 100, 0, "stack trace" },
    ^~~~~~~~~~~~~~~~~~~~~~~~
Makefile:115: recipe for target 'fds/bpf.o' failed
make[2]: *** [fds/bpf.o] Error 1
make[2]: Leaving directory '/<<PKGBUILDDIR>>'
debian/rules:25: recipe for target 'override_dh_auto_build' failed
make[1]: *** [override_dh_auto_build] Error 2
make[1]: Leaving directory '/<<PKGBUILDDIR>>'
debian/rules:27: recipe for target 'build-arch' failed
make: *** [build-arch] Error 2

Tail of log for python-apt on armhf:

  File "/<<PKGBUILDDIR>>/build/lib.linux-armv7l-2.7/apt/auth.py", line 133, in add_key_from_keyserver
    _add_key_from_keyserver(keyid, keyserver, tmp_keyring_dir)
  File "/<<PKGBUILDDIR>>/build/lib.linux-armv7l-2.7/apt/auth.py", line 161, in _add_key_from_keyserver
    keyserver, keyid))
AptKeyError: recv from 'hkp://localhost:19191' failed for '0xa1bD8E9D78F7FE5C3E65D8AF8B48AD6246925553'

----------------------------------------------------------------------
Ran 94 tests in 127.753s

FAILED (errors=1, skipped=2)
debian/rules:50: recipe for target 'override_dh_auto_test' failed
make[1]: *** [override_dh_auto_test] Error 1
make[1]: Leaving directory '/<<PKGBUILDDIR>>'
debian/rules:16: recipe for target 'build-arch' failed
make: *** [build-arch] Error 2

Tail of log for trilinos on armhf:

cd /<<PKGBUILDDIR>>/obj-arm-linux-gnueabihf/packages/zoltan/src && /usr/bin/cmake -E cmake_link_script CMakeFiles/trilinos_zoltan.dir/link.txt --verbose=1
/usr/bin/mpicc  -fPIC   -g -O2 -fdebug-prefix-map=/<<PKGBUILDDIR>>=. -fstack-protector-strong -Wformat -Werror=format-security -Wdate-time -D_FORTIFY_SOURCE=2 -Wl,-z,relro -Wl,--as-needed -shared -Wl,-soname,libtrilinos_zoltan.so.12 -o libtrilinos_zoltan.so.12.10.1 CMakeFiles/trilinos_zoltan.dir/all/all_allo.c.o CMakeFiles/trilinos_zoltan.dir/coloring/coloring.c.o CMakeFiles/trilinos_zoltan.dir/coloring/color_test.c.o CMakeFiles/trilinos_zoltan.dir/coloring/g2l_hash.c.o CMakeFiles/trilinos_zoltan.dir/coloring/bucket.c.o CMakeFiles/trilinos_zoltan.dir/graph/graph.c.o CMakeFiles/trilinos_zoltan.dir/ha/divide_machine.c.o CMakeFiles/trilinos_zoltan.dir/ha/get_processor_name.c.o CMakeFiles/trilinos_zoltan.dir/ha/ha_ovis.c.o CMakeFiles/trilinos_zoltan.dir/hier/hier.c.o CMakeFiles/trilinos_zoltan.dir/hier/hier_free_struct.c.o CMakeFiles/trilinos_zoltan.dir/hsfc/hsfc_box_assign.c.o CMakeFiles/trilinos_zoltan.dir/hsfc/hsfc.c.o CMakeFiles/trilinos_zoltan.dir/hsfc/hsfc_hilbert.c.o CMakeFiles/trilinos_zoltan.dir/hsfc/hsfc_point_assign.c.o CMakeFiles/trilinos_zoltan.dir/lb/lb_balance.c.o CMakeFiles/trilinos_zoltan.dir/lb/lb_box_assign.c.o CMakeFiles/trilinos_zoltan.dir/lb/lb_copy.c.o CMakeFiles/trilinos_zoltan.dir/lb/lb_eval.c.o CMakeFiles/trilinos_zoltan.dir/lb/lb_free.c.o CMakeFiles/trilinos_zoltan.dir/lb/lb_init.c.o CMakeFiles/trilinos_zoltan.dir/lb/lb_invert.c.o CMakeFiles/trilinos_zoltan.dir/lb/lb_migrate.c.o CMakeFiles/trilinos_zoltan.dir/lb/lb_part2proc.c.o CMakeFiles/trilinos_zoltan.dir/lb/lb_point_assign.c.o CMakeFiles/trilinos_zoltan.dir/lb/lb_remap.c.o CMakeFiles/trilinos_zoltan.dir/lb/lb_set_fn.c.o CMakeFiles/trilinos_zoltan.dir/lb/lb_set_method.c.o CMakeFiles/trilinos_zoltan.dir/lb/lb_set_part_sizes.c.o CMakeFiles/trilinos_zoltan.dir/matrix/matrix_build.c.o CMakeFiles/trilinos_zoltan.dir/matrix/matrix_distribute.c.o CMakeFiles/trilinos_zoltan.dir/matrix/matrix_operations.c.o CMakeFiles/trilinos_zoltan.dir/matrix/matrix_sym.c.o CMakeFiles/trilinos_zoltan.dir/matrix/matrix_utils.c.o CMakeFiles/trilinos_zoltan.dir/order/hsfcOrder.c.o CMakeFiles/trilinos_zoltan.dir/order/order.c.o CMakeFiles/trilinos_zoltan.dir/order/order_struct.c.o CMakeFiles/trilinos_zoltan.dir/order/order_tools.c.o CMakeFiles/trilinos_zoltan.dir/order/perm.c.o CMakeFiles/trilinos_zoltan.dir/par/par_average.c.o CMakeFiles/trilinos_zoltan.dir/par/par_bisect.c.o CMakeFiles/trilinos_zoltan.dir/par/par_median.c.o CMakeFiles/trilinos_zoltan.dir/par/par_median_randomized.c.o CMakeFiles/trilinos_zoltan.dir/par/par_stats.c.o CMakeFiles/trilinos_zoltan.dir/par/par_sync.c.o CMakeFiles/trilinos_zoltan.dir/par/par_tflops_special.c.o CMakeFiles/trilinos_zoltan.dir/params/assign_param_vals.c.o CMakeFiles/trilinos_zoltan.dir/params/bind_param.c.o CMakeFiles/trilinos_zoltan.dir/params/check_param.c.o CMakeFiles/trilinos_zoltan.dir/params/free_params.c.o CMakeFiles/trilinos_zoltan.dir/params/key_params.c.o CMakeFiles/trilinos_zoltan.dir/params/print_params.c.o CMakeFiles/trilinos_zoltan.dir/params/set_param.c.o CMakeFiles/trilinos_zoltan.dir/tpls/build_graph.c.o CMakeFiles/trilinos_zoltan.dir/tpls/postprocessing.c.o CMakeFiles/trilinos_zoltan.dir/tpls/preprocessing.c.o CMakeFiles/trilinos_zoltan.dir/tpls/scatter_graph.c.o CMakeFiles/trilinos_zoltan.dir/tpls/third_library.c.o CMakeFiles/trilinos_zoltan.dir/tpls/verify_graph.c.o CMakeFiles/trilinos_zoltan.dir/phg/phg_build.c.o CMakeFiles/trilinos_zoltan.dir/phg/phg_build_calls.c.o CMakeFiles/trilinos_zoltan.dir/phg/phg.c.o CMakeFiles/trilinos_zoltan.dir/phg/phg_lookup.c.o CMakeFiles/trilinos_zoltan.dir/phg/phg_verbose.c.o CMakeFiles/trilinos_zoltan.dir/phg/phg_coarse.c.o CMakeFiles/trilinos_zoltan.dir/phg/phg_comm.c.o CMakeFiles/trilinos_zoltan.dir/phg/phg_distrib.c.o CMakeFiles/trilinos_zoltan.dir/phg/phg_gather.c.o CMakeFiles/trilinos_zoltan.dir/phg/phg_hypergraph.c.o CMakeFiles/trilinos_zoltan.dir/phg/phg_match.c.o CMakeFiles/trilinos_zoltan.dir/phg/phg_order.c.o CMakeFiles/trilinos_zoltan.dir/phg/phg_parkway.c.o CMakeFiles/trilinos_zoltan.dir/phg/phg_patoh.c.o CMakeFiles/trilinos_zoltan.dir/phg/phg_plot.c.o CMakeFiles/trilinos_zoltan.dir/phg/phg_rdivide.c.o CMakeFiles/trilinos_zoltan.dir/phg/phg_refinement.c.o CMakeFiles/trilinos_zoltan.dir/phg/phg_scale.c.o CMakeFiles/trilinos_zoltan.dir/phg/phg_serialpartition.c.o CMakeFiles/trilinos_zoltan.dir/phg/phg_tree.c.o CMakeFiles/trilinos_zoltan.dir/phg/phg_two_ways.c.o CMakeFiles/trilinos_zoltan.dir/phg/phg_util.c.o CMakeFiles/trilinos_zoltan.dir/phg/phg_Vcycle.c.o CMakeFiles/trilinos_zoltan.dir/rcb/box_assign.c.o CMakeFiles/trilinos_zoltan.dir/rcb/create_proc_list.c.o CMakeFiles/trilinos_zoltan.dir/rcb/inertial1d.c.o CMakeFiles/trilinos_zoltan.dir/rcb/inertial2d.c.o CMakeFiles/trilinos_zoltan.dir/rcb/inertial3d.c.o CMakeFiles/trilinos_zoltan.dir/rcb/point_assign.c.o CMakeFiles/trilinos_zoltan.dir/rcb/rcb_box.c.o CMakeFiles/trilinos_zoltan.dir/rcb/rcb.c.o CMakeFiles/trilinos_zoltan.dir/rcb/rcb_util.c.o CMakeFiles/trilinos_zoltan.dir/rcb/rib.c.o CMakeFiles/trilinos_zoltan.dir/rcb/rib_util.c.o CMakeFiles/trilinos_zoltan.dir/rcb/shared.c.o CMakeFiles/trilinos_zoltan.dir/reftree/reftree_build.c.o CMakeFiles/trilinos_zoltan.dir/reftree/reftree_coarse_path.c.o CMakeFiles/trilinos_zoltan.dir/reftree/reftree_hash.c.o CMakeFiles/trilinos_zoltan.dir/reftree/reftree_part.c.o CMakeFiles/trilinos_zoltan.dir/simple/block.c.o CMakeFiles/trilinos_zoltan.dir/simple/cyclic.c.o CMakeFiles/trilinos_zoltan.dir/simple/random.c.o CMakeFiles/trilinos_zoltan.dir/timer/timer_params.c.o CMakeFiles/trilinos_zoltan.dir/Utilities/Communication/comm_exchange_sizes.c.o CMakeFiles/trilinos_zoltan.dir/Utilities/Communication/comm_invert_map.c.o CMakeFiles/trilinos_zoltan.dir/Utilities/Communication/comm_do.c.o CMakeFiles/trilinos_zoltan.dir/Utilities/Communication/comm_do_reverse.c.o CMakeFiles/trilinos_zoltan.dir/Utilities/Communication/comm_info.c.o CMakeFiles/trilinos_zoltan.dir/Utilities/Communication/comm_create.c.o CMakeFiles/trilinos_zoltan.dir/Utilities/Communication/comm_resize.c.o CMakeFiles/trilinos_zoltan.dir/Utilities/Communication/comm_sort_ints.c.o CMakeFiles/trilinos_zoltan.dir/Utilities/Communication/comm_destroy.c.o CMakeFiles/trilinos_zoltan.dir/Utilities/Communication/comm_invert_plan.c.o CMakeFiles/trilinos_zoltan.dir/Utilities/Timer/zoltan_timer.c.o CMakeFiles/trilinos_zoltan.dir/Utilities/Timer/timer.c.o CMakeFiles/trilinos_zoltan.dir/Utilities/DDirectory/DD_Find.c.o CMakeFiles/trilinos_zoltan.dir/Utilities/DDirectory/DD_Destroy.c.o CMakeFiles/trilinos_zoltan.dir/Utilities/DDirectory/DD_Set_Neighbor_Hash_Fn3.c.o CMakeFiles/trilinos_zoltan.dir/Utilities/DDirectory/DD_Remove.c.o CMakeFiles/trilinos_zoltan.dir/Utilities/DDirectory/DD_Create.c.o CMakeFiles/trilinos_zoltan.dir/Utilities/DDirectory/DD_Update.c.o CMakeFiles/trilinos_zoltan.dir/Utilities/DDirectory/DD_Stats.c.o CMakeFiles/trilinos_zoltan.dir/Utilities/DDirectory/DD_Hash2.c.o CMakeFiles/trilinos_zoltan.dir/Utilities/DDirectory/DD_Memory.c.o CMakeFiles/trilinos_zoltan.dir/Utilities/DDirectory/DD_Print.c.o CMakeFiles/trilinos_zoltan.dir/Utilities/DDirectory/DD_Set_Neighbor_Hash_Fn2.c.o CMakeFiles/trilinos_zoltan.dir/Utilities/DDirectory/DD_Set_Hash_Fn.c.o CMakeFiles/trilinos_zoltan.dir/Utilities/DDirectory/DD_Set_Neighbor_Hash_Fn1.c.o CMakeFiles/trilinos_zoltan.dir/Utilities/Memory/mem.c.o CMakeFiles/trilinos_zoltan.dir/Utilities/shared/zoltan_align.c.o CMakeFiles/trilinos_zoltan.dir/Utilities/shared/zoltan_id.c.o CMakeFiles/trilinos_zoltan.dir/zz/zz_coord.c.o CMakeFiles/trilinos_zoltan.dir/zz/zz_gen_files.c.o CMakeFiles/trilinos_zoltan.dir/zz/zz_hash.c.o CMakeFiles/trilinos_zoltan.dir/zz/zz_map.c.o CMakeFiles/trilinos_zoltan.dir/zz/zz_heap.c.o CMakeFiles/trilinos_zoltan.dir/zz/zz_init.c.o CMakeFiles/trilinos_zoltan.dir/zz/zz_obj_list.c.o CMakeFiles/trilinos_zoltan.dir/zz/zz_rand.c.o CMakeFiles/trilinos_zoltan.dir/zz/zz_set_fn.c.o CMakeFiles/trilinos_zoltan.dir/zz/zz_sort.c.o CMakeFiles/trilinos_zoltan.dir/zz/zz_struct.c.o CMakeFiles/trilinos_zoltan.dir/zz/zz_back_trace.c.o CMakeFiles/trilinos_zoltan.dir/zz/zz_util.c.o -lm /usr/lib/arm-linux-gnueabihf/libz.so 
cd /<<PKGBUILDDIR>>/obj-arm-linux-gnueabihf/packages/zoltan/src && /usr/bin/cmake -E cmake_symlink_library libtrilinos_zoltan.so.12.10.1 libtrilinos_zoltan.so.12 libtrilinos_zoltan.so
make[4]: Leaving directory '/<<PKGBUILDDIR>>/obj-arm-linux-gnueabihf'
[  4%] Built target trilinos_zoltan
make[3]: Leaving directory '/<<PKGBUILDDIR>>/obj-arm-linux-gnueabihf'
Makefile:163: recipe for target 'all' failed
make[2]: *** [all] Error 2
make[2]: Leaving directory '/<<PKGBUILDDIR>>/obj-arm-linux-gnueabihf'
dh_auto_build: make -j4 returned exit code 2
debian/rules:79: recipe for target 'override_dh_auto_build-arch' failed
make[1]: *** [override_dh_auto_build-arch] Error 2
make[1]: Leaving directory '/<<PKGBUILDDIR>>'
debian/rules:68: recipe for target 'build-arch' failed
make: *** [build-arch] Error 2

Tail of log for gfccore on armhf:

make[1]: Leaving directory '/<<PKGBUILDDIR>>'
if [ "reverse-patches" = "reverse-patches" ]; then rm -f debian/stamp-patched; fi
patches: 
if [ "reverse-patches" != "reverse-patches" ]; then touch debian/stamp-patched; fi
if [ "reverse-patches" != "reverse-patches" ] ; then \
	/usr/bin/make -f debian/rules update-config ; \
fi
for dir in debian/patches ; do \
    rm -f $dir/*.log ; \
done
set -e;    
dh_clean 
dh_clean: Compatibility levels before 5 are no longer supported (level 4 requested)
/usr/share/cdbs/1/rules/debhelper.mk:210: recipe for target 'clean' failed
make: *** [clean] Error 25

Tail of log for libqglviewer on armhf:

 typedef khronos_intptr_t GLintptr;
                          ^~~~~~~~
Makefile:548: recipe for target '.obj/camera.o' failed
make[1]: *** [.obj/camera.o] Error 1
make[1]: *** Waiting for unfinished jobs....
Makefile:576: recipe for target '.obj/manipulatedCameraFrame.o' failed
make[1]: *** [.obj/manipulatedCameraFrame.o] Error 1
Makefile:562: recipe for target '.obj/manipulatedFrame.o' failed
make[1]: *** [.obj/manipulatedFrame.o] Error 1
Makefile:534: recipe for target '.obj/qglviewer.o' failed
make[1]: *** [.obj/qglviewer.o] Error 1
make[1]: Leaving directory '/<<BUILDDIR>>/libqglviewer-2.6.3+dfsg2/QGLViewer'
dh_auto_test: make -j4 check returned exit code 2
debian/rules:4: recipe for target 'build-arch' failed
make: *** [build-arch] Error 2

Tail of log for acovea on armhf:

dh_testroot
rm -f build-stamp 
# Add here commands to clean up after the build process.
/usr/bin/make distclean
make[1]: Entering directory '/<<PKGBUILDDIR>>'
make[1]: *** No rule to make target 'distclean'.  Stop.
make[1]: Leaving directory '/<<PKGBUILDDIR>>'
debian/rules:45: recipe for target 'clean' failed
make: [clean] Error 2 (ignored)
cp -f /usr/share/misc/config.sub config.sub
cp -f /usr/share/misc/config.guess config.guess
dh_clean 
dh_clean: Compatibility levels before 5 are no longer supported (level 4 requested)
debian/rules:45: recipe for target 'clean' failed
make: *** [clean] Error 25

Tail of log for mingw32-binutils on armhf:

-----------------

dpkg-buildpackage: info: source package mingw32-binutils
dpkg-buildpackage: info: source version 2.20-0.2
dpkg-buildpackage: info: source distribution unstable
 dpkg-source --before-build mingw32-binutils-2.20
dpkg-buildpackage: info: host architecture armhf
 fakeroot debian/rules clean
dh_testdir
dh_testroot
rm -rf /<<PKGBUILDDIR>>/build_dir *-stamp
dh_clean
dh_clean: Compatibility levels before 5 are no longer supported (level 4 requested)
debian/rules:120: recipe for target 'clean' failed
make: *** [clean] Error 25

Tail of log for ocamlgsl on armhf:

lib/mlgsl_blas.h: In function 'CBLAS_DIAG_val':
lib/mlgsl_blas.h:23:28: warning: type of 'v' defaults to 'int' [-Wimplicit-int]
 static inline CBLAS_DIAG_t CBLAS_DIAG_val(v)
                            ^~~~~~~~~~~~~~
lib/mlgsl_blas.h: In function 'CBLAS_SIDE_val':
lib/mlgsl_blas.h:29:28: warning: type of 'v' defaults to 'int' [-Wimplicit-int]
 static inline CBLAS_SIDE_t CBLAS_SIDE_val(v)
                            ^~~~~~~~~~~~~~
Command exited with code 2.
E: Failure("Command ''/usr/bin/ocamlbuild' lib/libgsl_stubs.a lib/dllgsl_stubs.so lib/gsl.cma lib/gsl.cmxa lib/gsl.a lib/gsl.cmxs examples/blas_ex.native examples/blas_speed_test.native examples/bspline_ex.native examples/cheb_ex.native examples/combi_ex.native examples/const_ex.native examples/deriv_ex.native examples/eigen_ex.native examples/fft_c.native examples/fft_c2.native examples/fft_hc.native examples/fit_ex.native examples/histo_ex.native examples/integration_ex.native examples/interp_ex.native examples/linalg_ex.native examples/min_ex.native examples/monte_ex.native examples/multifit_data_ex.native examples/multifit_nlin_ex.native examples/multimin_ex.native examples/multiroot_ex.native examples/odeiv_ex.native examples/permut_ex.native examples/qrng_ex.native examples/rng_ex.native examples/root_ex.native examples/siman_ex.native examples/siman_tsp_ex.native examples/stats_ex.native examples/sum_ex.native examples/wavelet_ex.native -tag debug -tag tests' terminated with error code 10")
debian/rules:22: recipe for target 'override_dh_auto_build' failed
make[1]: *** [override_dh_auto_build] Error 1
make[1]: Leaving directory '/<<PKGBUILDDIR>>'
debian/rules:9: recipe for target 'build-arch' failed
make: *** [build-arch] Error 2

Tail of log for apf on armhf:

checking for suffix of object files... o
checking whether we are using the GNU C compiler... yes
checking whether arm-linux-gnueabihf-gcc accepts -g... yes
checking for arm-linux-gnueabihf-gcc option to accept ISO C89... none needed
checking for style of include used by make... GNU
checking dependency style of arm-linux-gnueabihf-gcc... gcc3
checking how to run the C preprocessor... arm-linux-gnueabihf-gcc -E
checking for grep that handles long lines and -e... /bin/grep
checking for egrep... /bin/grep -E
checking whether arm-linux-gnueabihf-gcc needs -traditional... no
checking for openssl... no
checking for SSL_library_init in -lssl... no
configure: error: "lib ssl not found!"
debian/rules:28: recipe for target 'config.status' failed
make: *** [config.status] Error 1

Tail of log for asterisk-chan-capi on armhf:

 #define CC_FORMAT_ULAW      AST_FORMAT_ULAW
                             ^
chan_capi.c:8777:23: note: in expansion of macro 'CC_FORMAT_ULAW'
     capi_capability = CC_FORMAT_ULAW;
                       ^~~~~~~~~~~~~~
chan_capi.c: In function 'unload_module':
chan_capi.c:8883:4: warning: implicit declaration of function 'ast_smoother_free' [-Wimplicit-function-declaration]
    ast_smoother_free(i->smoother);
    ^~~~~~~~~~~~~~~~~
Makefile:197: recipe for target 'chan_capi.o' failed
make[1]: *** [chan_capi.o] Error 1
make[1]: Leaving directory '/<<PKGBUILDDIR>>'
dh_auto_build: make -j1 returned exit code 2
debian/rules:3: recipe for target 'build-arch' failed
make: *** [build-arch] Error 2

Tail of log for audacious-analog-vumeter-plugin on armhf:

 #include <gtk/gtk.h>
                     ^
compilation terminated.
Makefile:321: recipe for target 'plugin_main.lo' failed
make[3]: *** [plugin_main.lo] Error 1
make[3]: Leaving directory '/<<PKGBUILDDIR>>/src'
Makefile:365: recipe for target 'all-recursive' failed
make[2]: *** [all-recursive] Error 1
make[2]: Leaving directory '/<<PKGBUILDDIR>>'
Makefile:254: recipe for target 'all' failed
make[1]: *** [all] Error 2
make[1]: Leaving directory '/<<PKGBUILDDIR>>'
dh_auto_build: make -j1 returned exit code 2
debian/rules:8: recipe for target 'build-arch' failed
make: *** [build-arch] Error 2

Tail of log for bagel on armhf:

Makefile:500: recipe for target 'all-recursive' failed
make[4]: *** [all-recursive] Error 1
make[4]: Leaving directory '/<<PKGBUILDDIR>>/src/util'
Makefile:584: recipe for target 'all-recursive' failed
make[3]: *** [all-recursive] Error 1
make[3]: Leaving directory '/<<PKGBUILDDIR>>/src'
Makefile:416: recipe for target 'all-recursive' failed
make[2]: *** [all-recursive] Error 1
make[2]: Leaving directory '/<<PKGBUILDDIR>>'
Makefile:348: recipe for target 'all' failed
make[1]: *** [all] Error 2
make[1]: Leaving directory '/<<PKGBUILDDIR>>'
dh_auto_build: make -j1 returned exit code 2
debian/rules:9: recipe for target 'build-arch' failed
make: *** [build-arch] Error 2

Tail of log for bio-eagle on armhf:

/usr/include/c++/6/bits/stl_algo.h:1887:2: note: parameter passing for argument of type '__gnu_cxx::__normal_iterator<EAGLE::DipTreeNode*, std::vector<EAGLE::DipTreeNode> >' will change in GCC 7.1
  std::__insertion_sort(__first, __last, __comp);
  ^~~
g++ -g -O2 -fdebug-prefix-map=/<<PKGBUILDDIR>>=. -fstack-protector-strong -Wformat -Werror=format-security -O2 -std=c++0x -fopenmp -Wall -Wdate-time -D_FORTIFY_SOURCE=2  -o Eagle.o -c Eagle.cpp
In file included from Eagle.cpp:43:0:
MemoryUtils.hpp:34:23: fatal error: xmmintrin.h: No such file or directory
 #include <xmmintrin.h>
                       ^
compilation terminated.
Makefile:99: recipe for target 'Eagle.o' failed
make[1]: *** [Eagle.o] Error 1
make[1]: Leaving directory '/<<PKGBUILDDIR>>/src'
dh_auto_build: make -j1 returned exit code 2
debian/rules:6: recipe for target 'build-arch' failed
make: *** [build-arch] Error 2

Tail of log for cde on armhf:

Makefile:543: recipe for target 'strace.o' failed
make[4]: *** [strace.o] Error 1
make[4]: Leaving directory '/<<BUILDDIR>>/cde-0.1+git9-g551e54d/strace-4.6'
Makefile:601: recipe for target 'all-recursive' failed
make[3]: *** [all-recursive] Error 1
make[3]: Leaving directory '/<<BUILDDIR>>/cde-0.1+git9-g551e54d/strace-4.6'
Makefile:375: recipe for target 'all' failed
make[2]: *** [all] Error 2
make[2]: Leaving directory '/<<BUILDDIR>>/cde-0.1+git9-g551e54d/strace-4.6'
Makefile:6: recipe for target 'all' failed
make[1]: *** [all] Error 2
make[1]: Leaving directory '/<<BUILDDIR>>/cde-0.1+git9-g551e54d'
dh_auto_build: make -j1 returned exit code 2
debian/rules:38: recipe for target 'build-arch' failed
make: *** [build-arch] Error 2

Tail of log for bino on armhf:

#define LIBASS_PKGCONFIG_VERSION "0.13.4"
#define HAVE_AL_AL_H 1
#define HAVE_X11 1
#define HAVE_LIBEQUALIZER 0
#define HAVE_LIBXNVCTRL 0
#define HAVE_LIRC 1
#define LIRC_PKGCONFIG_VERSION "0.9.4c"

configure: exit 1
dh_auto_configure: ./configure --build=arm-linux-gnueabihf --prefix=/usr --includedir=${prefix}/include --mandir=${prefix}/share/man --infodir=${prefix}/share/info --sysconfdir=/etc --localstatedir=/var --disable-silent-rules --libdir=${prefix}/lib/arm-linux-gnueabihf --libexecdir=${prefix}/lib/arm-linux-gnueabihf --disable-maintainer-mode --disable-dependency-tracking --htmldir=${docdir}/html --without-equalizer --disable-silent-rules --with-qt-version=5 returned exit code 1
debian/rules:12: recipe for target 'override_dh_auto_configure' failed
make[1]: *** [override_dh_auto_configure] Error 2
make[1]: Leaving directory '/<<PKGBUILDDIR>>'
debian/rules:9: recipe for target 'build-arch' failed
make: *** [build-arch] Error 2

Tail of log for ck on armhf:

{standard input}:773: Error: selected processor does not support `strexbeq r2,r8,[r5]' in ARM mode
Makefile:18: recipe for target 'ck_pr_cas' failed
make[4]: *** [ck_pr_cas] Error 1
make[4]: Leaving directory '/<<PKGBUILDDIR>>/regressions/ck_pr/validate'
Makefile:29: recipe for target 'all' failed
make[3]: *** [all] Error 2
make[3]: Leaving directory '/<<PKGBUILDDIR>>/regressions'
Makefile:27: recipe for target 'regressions' failed
make[2]: *** [regressions] Error 2
make[2]: Leaving directory '/<<PKGBUILDDIR>>'
debian/rules:15: recipe for target 'override_dh_auto_test' failed
make[1]: *** [override_dh_auto_test] Error 2
make[1]: Leaving directory '/<<PKGBUILDDIR>>'
debian/rules:18: recipe for target 'build-arch' failed
make: *** [build-arch] Error 2

Tail of log for consul-migrate on armhf:

=== RUN   TestMigrator_new
--- PASS: TestMigrator_new (0.00s)
=== RUN   TestMigrator_migrate
--- FAIL: TestMigrator_migrate (0.00s)
	migrator_test.go:130: err: Failed to connect MDB: MDB_INVALID: File is not an LMDB file %!s(MISSING)
=== RUN   TestMigrator_migrate_fails
--- PASS: TestMigrator_migrate_fails (0.52s)
=== RUN   TestMigrator_migrate_noop
--- PASS: TestMigrator_migrate_noop (0.00s)
FAIL
exit status 1
FAIL	github.com/hashicorp/consul-migrate/migrator	0.588s
dh_auto_test: go test -v -p 1 github.com/hashicorp/consul-migrate github.com/hashicorp/consul-migrate/migrator returned exit code 1
debian/rules:7: recipe for target 'build-arch' failed
make: *** [build-arch] Error 1

Tail of log for criu on armhf:

  ^~~~~
arch/arm/include/asm/atomic.h: In function 'atomic_add_return':
arch/arm/include/asm/atomic.h:81:2: error: implicit declaration of function 'smp_mb' [-Werror=implicit-function-declaration]
  smp_mb();
  ^~~~~~
cc1: all warnings being treated as errors
scripts/Makefile.build:184: recipe for target 'arch/arm/crtools.o' failed
make[2]: *** [arch/arm/crtools.o] Error 1
make[2]: Leaving directory '/<<PKGBUILDDIR>>'
Makefile:208: recipe for target 'arch/arm' failed
make[1]: *** [arch/arm] Error 2
make[1]: Leaving directory '/<<PKGBUILDDIR>>'
dh_auto_build: make -j4 returned exit code 2
debian/rules:6: recipe for target 'build-arch' failed
make: *** [build-arch] Error 2

Tail of log for djbdns on armhf:

 dpkg-source --before-build djbdns-1.05
dpkg-buildpackage: info: host architecture armhf
 fakeroot debian/rules clean
rm -f `cat TARGETS`
for i in dbndns/*; do test -d $i || rm -f $i; done
test ! -e patch-stamp || \
  for i in `ls -1r debian/diff/*.diff || :`; do patch -p1 -R <$i; done
rm -f configure-stamp patch-stamp build-stamp \
  dbndns/patch-stamp dbndns/build-stamp
rm -rf '/<<PKGBUILDDIR>>/debian/djbdns' '/<<PKGBUILDDIR>>/debian/dbndns' '/<<PKGBUILDDIR>>/debian/dnscache-run'
rm -f debian/files debian/substvars changelog
test ! -r conf-home'{orig}' || mv -f conf-home'{orig}' conf-home
test ! -r conf-cc'{orig}' || mv conf-cc'{orig}' conf-cc
 debian/rules build-arch
make: *** No rule to make target 'build-arch'.  Stop.

Tail of log for cross-binutils on armhf:

SCHROOT_USER=buildd
SHELL=/bin/sh
TERM=xterm
USER=buildd

dpkg-buildpackage
-----------------

dpkg-buildpackage: info: source package cross-binutils
dpkg-buildpackage: info: source version 0.26
dpkg-buildpackage: info: source distribution unstable
 dpkg-source --before-build cross-binutils-0.26
dpkg-buildpackage: info: host architecture armhf
 fakeroot debian/rules clean
debian/rules:31: *** unknown distro "Raspbian". Nothing will be built..  Stop.

Tail of log for cpl-plugin-xsh on armhf:

Makefile:849: recipe for target 'xsh_utils.lo' failed
make[4]: *** [xsh_utils.lo] Error 1
make[4]: Leaving directory '/<<BUILDDIR>>/cpl-plugin-xsh-2.3.0+dfsg/xsh'
Makefile:885: recipe for target 'all-recursive' failed
make[3]: *** [all-recursive] Error 1
make[3]: Leaving directory '/<<BUILDDIR>>/cpl-plugin-xsh-2.3.0+dfsg/xsh'
Makefile:530: recipe for target 'all-recursive' failed
make[2]: *** [all-recursive] Error 1
make[2]: Leaving directory '/<<BUILDDIR>>/cpl-plugin-xsh-2.3.0+dfsg'
Makefile:436: recipe for target 'all' failed
make[1]: *** [all] Error 2
make[1]: Leaving directory '/<<BUILDDIR>>/cpl-plugin-xsh-2.3.0+dfsg'
dh_auto_build: make -j1 returned exit code 2
debian/rules:14: recipe for target 'build-arch' failed
make: *** [build-arch] Error 2

Tail of log for efitools on armhf:

	make -j1
make[1]: Entering directory '/<<PKGBUILDDIR>>'
make -C lib lib-efi.a
make[2]: Entering directory '/<<PKGBUILDDIR>>/lib'
cc -I/<<PKGBUILDDIR>>/include/ -I/usr/include/efi -I/usr/include/efi/armv7l -I/usr/include/efi/protocol -O2 -fpic -Wall -fshort-wchar -fno-strict-aliasing -fno-merge-constants -mno-red-zone -fno-stack-protector -g -DCONFIG_armv7l -fno-toplevel-reorder -DBUILD_EFI -c simple_file.c -o simple_file.efi.o
cc: error: unrecognized command line option '-mno-red-zone'; did you mean '-fno-regmove'?
../Make.rules:53: recipe for target 'simple_file.efi.o' failed
make[2]: *** [simple_file.efi.o] Error 1
make[2]: Leaving directory '/<<PKGBUILDDIR>>/lib'
Makefile:29: recipe for target 'lib/lib-efi.a' failed
make[1]: *** [lib/lib-efi.a] Error 2
make[1]: Leaving directory '/<<PKGBUILDDIR>>'
dh_auto_build: make -j1 returned exit code 2
debian/rules:11: recipe for target 'build-arch' failed
make: *** [build-arch] Error 2

Tail of log for eclipse-titan on armhf:

Binary file (standard input) matches

Tail of log for ezquake on armhf:

mkdir -p .ezquake
cc -c -g -O2 -fdebug-prefix-map=/<<BUILDDIR>>/ezquake-2.2+git20150324=. -fstack-protector-strong -Wformat -Werror=format-security -Wdate-time -D_FORTIFY_SOURCE=2   -fvisibility=hidden -DCPUSTRING='"arm"' -DBUILDSTRING='"Linux"' -DREVISION=666 -DVERSION='"r666"'  -I/usr/include/SDL2 -D_REENTRANT -DJSS_CAM -DUSE_PR2 -DWITH_NQPROGS -DUSE_SDL2 -DWITH_ZIP -DWITH_ZLIB   -I/usr/include/libpng16 -DWITH_PNG -D__Q_PNG14__ -I/usr/include/arm-linux-gnueabihf -o .ezquake/pr_exec.o pr_exec.c
mkdir -p .ezquake
cc -c -g -O2 -fdebug-prefix-map=/<<BUILDDIR>>/ezquake-2.2+git20150324=. -fstack-protector-strong -Wformat -Werror=format-security -Wdate-time -D_FORTIFY_SOURCE=2   -fvisibility=hidden -DCPUSTRING='"arm"' -DBUILDSTRING='"Linux"' -DREVISION=666 -DVERSION='"r666"'  -I/usr/include/SDL2 -D_REENTRANT -DJSS_CAM -DUSE_PR2 -DWITH_NQPROGS -DUSE_SDL2 -DWITH_ZIP -DWITH_ZLIB   -I/usr/include/libpng16 -DWITH_PNG -D__Q_PNG14__ -I/usr/include/arm-linux-gnueabihf -o .ezquake/pr2_cmds.o pr2_cmds.c
pr2_cmds.c: In function 'sv_syscall':
pr2_cmds.c:3007:2: error: cannot convert to a pointer type
  pr2_API[arg] ( 0, (unsigned int) ~0, (pr2val_t*)ap, &ret);
  ^~~~~~~
Makefile:385: recipe for target '.ezquake/pr2_cmds.o' failed
make[1]: *** [.ezquake/pr2_cmds.o] Error 1
make[1]: *** Waiting for unfinished jobs....
make[1]: Leaving directory '/<<BUILDDIR>>/ezquake-2.2+git20150324'
dh_auto_build: make -j4 returned exit code 2
debian/rules:14: recipe for target 'build-arch' failed
make: *** [build-arch] Error 2

Tail of log for compiz on armhf:

[ 33%] Built target compizconfig
[ 33%] Linking CXX static library libresize_logic.a
cd /<<BUILDDIR>>/compiz-0.9.13.0+16.10.20160818.2/obj-arm-linux-gnueabihf/plugins/resize/src/logic && /usr/bin/cmake -P CMakeFiles/resize_logic.dir/cmake_clean_target.cmake
cd /<<BUILDDIR>>/compiz-0.9.13.0+16.10.20160818.2/obj-arm-linux-gnueabihf/plugins/resize/src/logic && /usr/bin/cmake -E cmake_link_script CMakeFiles/resize_logic.dir/link.txt --verbose=1
/usr/bin/ar qc libresize_logic.a  CMakeFiles/resize_logic.dir/src/resize-logic.cpp.o
/usr/bin/ranlib libresize_logic.a
make[3]: Leaving directory '/<<BUILDDIR>>/compiz-0.9.13.0+16.10.20160818.2/obj-arm-linux-gnueabihf'
[ 33%] Built target resize_logic
make[2]: Leaving directory '/<<BUILDDIR>>/compiz-0.9.13.0+16.10.20160818.2/obj-arm-linux-gnueabihf'
Makefile:163: recipe for target 'all' failed
make[1]: *** [all] Error 2
make[1]: Leaving directory '/<<BUILDDIR>>/compiz-0.9.13.0+16.10.20160818.2/obj-arm-linux-gnueabihf'
dh_auto_build: make -j4 returned exit code 2
debian/rules:82: recipe for target 'build-arch' failed
make: *** [build-arch] Error 2

Tail of log for freefoam on armhf:

collect2: error: ld returned 1 exit status
CMakeFiles/cmTC_a5d68.dir/build.make:97: recipe for target 'cmTC_a5d68' failed
make[3]: *** [cmTC_a5d68] Error 1
make[3]: Leaving directory '/<<BUILDDIR>>/freefoam-0.1.0+dfsg+1/obj-arm-linux-gnueabihf/CMakeFiles/CMakeTmp'
Makefile:126: recipe for target 'cmTC_a5d68/fast' failed
make[2]: *** [cmTC_a5d68/fast] Error 2
make[2]: Leaving directory '/<<BUILDDIR>>/freefoam-0.1.0+dfsg+1/obj-arm-linux-gnueabihf/CMakeFiles/CMakeTmp'


dh_auto_configure: cmake .. -DCMAKE_INSTALL_PREFIX=/usr -DCMAKE_VERBOSE_MAKEFILE=ON -DCMAKE_BUILD_TYPE=None -DCMAKE_INSTALL_SYSCONFDIR=/etc -DCMAKE_INSTALL_LOCALSTATEDIR=/var -DFOAM_EXE_PREFIX=freefoam- -DFOAM_ENABLE_METIS=OFF -DFOAM_ENABLE_MGRIDGEN=OFF -DFOAM_USE_MPI=ON -DFOAM_DEFAULT_PSTREAM=mpi -DFOAM_DOUBLE_PRECISION=ON -DFOAM_ENABLE_PARMETIS=OFF -DCMAKE_SKIP_RPATH=OFF -DFOAM_ENABLE_CCMIO=OFF -DBUILD_TESTING=OFF -DFOAM_ENABLE_FULL_TUTORIAL_TEST=OFF -DFOAM_BUILD_PRIVATE_METIS=OFF -DFOAM_BUILD_PRIVATE_PARMETIS=OFF -DFOAM_BUILD_PRIVATE_SCOTCH=OFF -DFOAM_BUILD_PRIVATE_ZLIB=OFF -DFOAM_ENABLE_PDF_GUIDES=OFF -DFOAM_ENABLE_XHTML_GUIDES=OFF -DFOAM_ENABLE_XHTML_HELP=OFF -DFOAM_ENABLE_MATHJAX=OFF -DFOAM_ENABLE_MANPAGE_HELP=OFF -DFOAM_DOCS_FOR_SF=OFF -DFOAM_INSTALL_BIN_PATH=/usr/bin -DFOAM_INSTALL_CMAKE_PATH=/usr/share/freefoam/CMake -DFOAM_INSTALL_CONFIG_PATH=/etc/freefoam -DFOAM_INSTALL_DATA_PATH=/usr/share/freefoam -DFOAM_INSTALL_DOC_PATH=/usr/share/doc/freefoam -DFOAM_INSTALL_HEADER_PATH=/usr/include/freefoam -DFOAM_INSTALL_LIBEXEC_PATH=/usr/bin -DFOAM_INSTALL_LIBRARY_PATH=/usr/lib/freefoam -DFOAM_INSTALL_MAN_PATH=/usr/share/man -DFOAM_INSTALL_PLUGIN_PATH=/usr/lib/freefoam/plugins1 -DFOAM_INSTALL_TUTORIALS_PATH=/usr/share/doc/freefoam -DFOAM_INSTALL_USERDFOAM_PATH=/usr/lib/freefoam/plugins1/ensightReader -DFOAM_ENABLE_DOXYGEN_DOCS=OFF returned exit code 1
debian/rules:68: recipe for target 'override_dh_auto_configure' failed
make[1]: *** [override_dh_auto_configure] Error 255
make[1]: Leaving directory '/<<BUILDDIR>>/freefoam-0.1.0+dfsg+1'
debian/rules:3: recipe for target 'build-arch' failed
make: *** [build-arch] Error 2

Tail of log for grpc on armhf:

[C]       Compiling src/core/security/google_default_credentials.c
[C]       Compiling src/core/security/json_token.c
[C]       Compiling src/core/security/jwt_verifier.c
src/core/security/jwt_verifier.c: In function 'pkey_from_jwk':
src/core/security/jwt_verifier.c:464:10: error: dereferencing pointer to incomplete type 'RSA {aka struct rsa_st}'
       rsa->n = bignum_from_base64(validate_string_field(key_prop, "n"));
          ^~
Makefile:3631: recipe for target '/<<PKGBUILDDIR>>/objs/opt/src/core/security/jwt_verifier.o' failed
make[2]: *** [/<<PKGBUILDDIR>>/objs/opt/src/core/security/jwt_verifier.o] Error 1
make[2]: Leaving directory '/<<PKGBUILDDIR>>'
debian/rules:18: recipe for target 'override_dh_auto_build' failed
make[1]: *** [override_dh_auto_build] Error 2
make[1]: Leaving directory '/<<PKGBUILDDIR>>'
debian/rules:29: recipe for target 'build-arch' failed
make: *** [build-arch] Error 2

Tail of log for haskell-cryptol on armhf:

No uhc found
touch configure-ghc-stamp
. /usr/share/haskell-devscripts/Dh_Haskell.sh && \
build_recipe
Running debian/hlibrary.setup build --builddir=dist-ghc
Building cryptol-2.4.0...
Preprocessing library cryptol-2.4.0...

src/Cryptol/Eval/Arch.hs:25:2: error:
     error: #error unknown max width for gmp on this architecture
     #error unknown max width for gmp on this architecture
      ^~~~~
`gcc' failed in phase `C pre-processor'. (Exit code: 1)
/usr/share/cdbs/1/class/hlibrary.mk:147: recipe for target 'build-ghc-stamp' failed
make: *** [build-ghc-stamp] Error 1

Tail of log for form on armhf:

1 of 1 test failed
Please report to form@nikhef.nl
===============================
Makefile:236: recipe for target 'check-TESTS' failed
make[3]: *** [check-TESTS] Error 1
make[3]: Leaving directory '/<<PKGBUILDDIR>>/check'
Makefile:359: recipe for target 'check-am' failed
make[2]: *** [check-am] Error 2
make[2]: Leaving directory '/<<PKGBUILDDIR>>/check'
Makefile:311: recipe for target 'check-recursive' failed
make[1]: *** [check-recursive] Error 1
make[1]: Leaving directory '/<<PKGBUILDDIR>>'
dh_auto_test: make -j4 check VERBOSE=1 returned exit code 2
debian/rules:10: recipe for target 'build-arch' failed
make: *** [build-arch] Error 2

Tail of log for haskell-type-level on armhf:

        The liberal coverage condition fails in class `Div'
          for functional dependency: `x z -> y'
        Reason: lhs types `x', `q' do not jointly determine rhs type `y'
        Un-determined variable: y
    * In the instance declaration for `Div x y q'

src/Data/TypeLevel/Num/Ops.hs:336:10: error:
    * Illegal instance declaration for `Div10 x q'
        The liberal coverage condition fails in class `Div10'
          for functional dependency: `q -> x'
        Reason: lhs type `q' does not determine rhs type `x'
        Un-determined variable: x
    * In the instance declaration for `Div10 x q'
/usr/share/cdbs/1/class/hlibrary.mk:147: recipe for target 'build-ghc-stamp' failed
make: *** [build-ghc-stamp] Error 1

Tail of log for intel-processor-trace on armhf:

                        ^~~~~~~~~
/<<PKGBUILDDIR>>/libipt/src/posix/pt_section_posix.c:114:24: note: each undeclared identifier is reported only once for each function it appears in
libipt/CMakeFiles/libipt.dir/build.make:593: recipe for target 'libipt/CMakeFiles/libipt.dir/src/posix/pt_section_posix.c.o' failed
make[3]: *** [libipt/CMakeFiles/libipt.dir/src/posix/pt_section_posix.c.o] Error 1
make[3]: Leaving directory '/<<PKGBUILDDIR>>/obj-arm-linux-gnueabihf'
CMakeFiles/Makefile2:88: recipe for target 'libipt/CMakeFiles/libipt.dir/all' failed
make[2]: *** [libipt/CMakeFiles/libipt.dir/all] Error 2
make[2]: Leaving directory '/<<PKGBUILDDIR>>/obj-arm-linux-gnueabihf'
Makefile:130: recipe for target 'all' failed
make[1]: *** [all] Error 2
make[1]: Leaving directory '/<<PKGBUILDDIR>>/obj-arm-linux-gnueabihf'
dh_auto_build: make -j1 returned exit code 2
	cd /<<PKGBUILDDIR>>
debian/rules:10: recipe for target 'build-arch' failed
make: *** [build-arch] Error 2

Tail of log for ioapps on armhf:

           ^~~~~~~~~~~~~~~
replicate.c:104:36: warning: 'last_call_orig' may be used uninitialized in this function [-Wmaybe-uninitialized]
      diff_orig = CALL_TIME(x##_it) - last_call_orig; \
                                    ^
replicate.c:1396:11: note: 'last_call_orig' was declared here
  uint64_t last_call_orig; ///< when was the last original call made
           ^~~~~~~~~~~~~~
Makefile:46: recipe for target 'replicate.o' failed
make[2]: *** [replicate.o] Error 1
make[2]: Leaving directory '/<<PKGBUILDDIR>>'
debian/rules:18: recipe for target 'override_dh_auto_build' failed
make[1]: *** [override_dh_auto_build] Error 2
make[1]: Leaving directory '/<<PKGBUILDDIR>>'
debian/rules:14: recipe for target 'build-arch' failed
make: *** [build-arch] Error 2

Tail of log for gambc on armhf:

making all in gsi
make[2]: Entering directory '/<<PKGBUILDDIR>>/gsi'
make[2]: Leaving directory '/<<PKGBUILDDIR>>/gsi'
making all in gsc
make[2]: Entering directory '/<<PKGBUILDDIR>>/gsc'
LD_LIBRARY_PATH=../lib:../gsi:../gsc: ../gsc-comp -:=.. -f -c -check _gsclib.scm
Segmentation fault
makefile:176: recipe for target '_gsclib.c' failed
make[2]: *** [_gsclib.c] Error 139
make[2]: Leaving directory '/<<PKGBUILDDIR>>/gsc'
makefile:216: recipe for target 'all-recursive' failed
make[1]: *** [all-recursive] Error 1
make[1]: Leaving directory '/<<PKGBUILDDIR>>'
debian/rules:44: recipe for target 'build-stamp' failed
make: *** [build-stamp] Error 2

Tail of log for jocaml on armhf:

| 1 file changed, 5 insertions(+)
|
|diff --git a/tools/ocamlmklib.ml b/tools/ocamlmklib.ml
|index 23a273e..a5e0d34 100644
|--- a/tools/ocamlmklib.ml
|+++ b/tools/ocamlmklib.ml
--------------------------
No file to patch.  Skipping patch.
1 out of 1 hunk ignored
Patch debian/patches/0003-Don-t-use-rpath.patch does not apply (enforce with -f)
debian/rules:18: recipe for target 'override_dh_auto_configure' failed
make[1]: *** [override_dh_auto_configure] Error 1
make[1]: Leaving directory '/<<PKGBUILDDIR>>'
debian/rules:85: recipe for target 'build-arch' failed
make: *** [build-arch] Error 2

Tail of log for libmlx5 on armhf:

Makefile:556: recipe for target 'buf.lo' failed
make[2]: *** [buf.lo] Error 1
cc1: all warnings being treated as errors
Makefile:577: recipe for target 'mlx5.lo' failed
make[2]: *** [mlx5.lo] Error 1
cc1: all warnings being treated as errors
Makefile:563: recipe for target 'cq.lo' failed
make[2]: *** [cq.lo] Error 1
make[2]: Leaving directory '/<<PKGBUILDDIR>>'
Makefile:381: recipe for target 'all' failed
make[1]: *** [all] Error 2
make[1]: Leaving directory '/<<PKGBUILDDIR>>'
dh_auto_build: make -j4 returned exit code 2
debian/rules:6: recipe for target 'build-arch' failed
make: *** [build-arch] Error 2

Tail of log for ibam on armhf:

make[1]: 'ibam-krell.so' is up to date.
make[1]: Leaving directory '/<<PKGBUILDDIR>>'
touch build-stamp
dh_testdir
dh_testroot
dh_clean
dh_clean: Compatibility levels before 9 are deprecated (level 7 in use)
dh_installdirs
dh_installdirs: Compatibility levels before 9 are deprecated (level 7 in use)
# Add here commands to install the package into debian/tmp.
install -m0755 ibam `pwd`/debian/ibam/usr/bin
install -m0644 ibam-krell.so `pwd`/debian/gkrellm-ibam/usr/lib/gkrellm2/plugins
install: cannot create regular file '/<<PKGBUILDDIR>>/debian/gkrellm-ibam/usr/lib/gkrellm2/plugins': No such file or directory
debian/rules:51: recipe for target 'install' failed
make: *** [install] Error 1

Tail of log for libnunc-stans on armhf:

/tmp/ccxx6j3c.s: Assembler messages:
/tmp/ccxx6j3c.s:54: Error: selected processor does not support `ldrexd r6,r7,[lr]' in ARM mode
/tmp/ccxx6j3c.s:54: Error: selected processor does not support `strexd r0,r2,r3,[lr]' in ARM mode
makefile.linux:76: recipe for target 'obj/abstraction_dcas.o' failed
make[3]: *** [obj/abstraction_dcas.o] Error 1
make[3]: Leaving directory '/<<PKGBUILDDIR>>/liblfds'
Makefile:921: recipe for target 'all-recursive' failed
make[2]: *** [all-recursive] Error 1
make[2]: Leaving directory '/<<PKGBUILDDIR>>'
Makefile:646: recipe for target 'all' failed
make[1]: *** [all] Error 2
make[1]: Leaving directory '/<<PKGBUILDDIR>>'
dh_auto_build: make -j1 returned exit code 2
debian/rules:21: recipe for target 'build-arch' failed
make: *** [build-arch] Error 2

Tail of log for libretro-mupen64plus on armhf:

gles2rice/src/RenderBase_neon.S:205: Error: selected processor does not support `movw r8,#0x0000ffff' in ARM mode
gles2rice/src/RenderBase_neon.S:206: Error: selected processor does not support `movt r8,#0x7f7f' in ARM mode
gles2rice/src/RenderBase_neon.S:248: Error: selected processor does not support `movt r8,#0x437f' in ARM mode
gles2rice/src/RenderBase_neon.S:287: Error: selected processor does not support `movw r8,#0' in ARM mode
gles2rice/src/RenderBase_neon.S:288: Error: selected processor does not support `movt r8,#0x4f7f' in ARM mode
Makefile:402: recipe for target 'gles2rice/src/RenderBase_neon.o' failed
make[2]: *** [gles2rice/src/RenderBase_neon.o] Error 1
make[2]: *** Waiting for unfinished jobs....
make[2]: Leaving directory '/<<BUILDDIR>>/libretro-mupen64plus-2.0+git20160207+dfsg2'
dh_auto_build: make -j4 platform=armv gles neon hardfloat returned exit code 2
debian/rules:19: recipe for target 'override_dh_auto_build' failed
make[1]: *** [override_dh_auto_build] Error 2
make[1]: Leaving directory '/<<BUILDDIR>>/libretro-mupen64plus-2.0+git20160207+dfsg2'
debian/rules:16: recipe for target 'build-arch' failed
make: *** [build-arch] Error 2

Tail of log for libtango on armhf:

dpkg-buildpackage: info: host architecture armhf
 fakeroot debian/rules clean
QUILT_PATCHES=debian/patches \
	quilt --quiltrc /dev/null pop -a -R || test $? = 2
No patch removed
rm -rf .pc debian/stamp-patched
dh_testdir
dh_testroot
rm -rf stamps objs
find build -type d -name "objs-*" | xargs rm -rf
rm -f build-stamp-*
dh_clean
dh_clean: Compatibility levels before 9 are deprecated (level 7 in use)
 debian/rules build-arch
make: *** No rule to make target 'build-arch'.  Stop.

Tail of log for listaller on armhf:

cd /<<PKGBUILDDIR>>/obj-arm-linux-gnueabihf/src && /usr/bin/g-ir-compiler --shared-library=listaller-glib --includedir=. /<<PKGBUILDDIR>>/obj-arm-linux-gnueabihf/src/Listaller-0.5.gir -o /<<PKGBUILDDIR>>/obj-arm-linux-gnueabihf/src/Listaller-0.5.typelib
Could not find GIR file 'AppStream-0.7.gir'; check XDG_DATA_DIRS or use --includedir
error parsing file /<<PKGBUILDDIR>>/obj-arm-linux-gnueabihf/src/Listaller-0.5.gir: Failed to parse included gir AppStream-0.7
src/CMakeFiles/gir-compile.dir/build.make:60: recipe for target 'src/CMakeFiles/gir-compile' failed
make[3]: *** [src/CMakeFiles/gir-compile] Error 1
make[3]: Leaving directory '/<<PKGBUILDDIR>>/obj-arm-linux-gnueabihf'
CMakeFiles/Makefile2:194: recipe for target 'src/CMakeFiles/gir-compile.dir/all' failed
make[2]: *** [src/CMakeFiles/gir-compile.dir/all] Error 2
make[2]: Leaving directory '/<<PKGBUILDDIR>>/obj-arm-linux-gnueabihf'
Makefile:141: recipe for target 'all' failed
make[1]: *** [all] Error 2
make[1]: Leaving directory '/<<PKGBUILDDIR>>/obj-arm-linux-gnueabihf'
dh_auto_build: make -j1 returned exit code 2
debian/rules:15: recipe for target 'build-arch' failed
make: *** [build-arch] Error 2

Tail of log for mdp-src on armhf:

cc -g -O2 -fdebug-prefix-map=/<<PKGBUILDDIR>>=. -fstack-protector-strong -Wformat -Werror=format-security -Wall -Wdate-time -D_FORTIFY_SOURCE=2 -I../include  -c -o viewer.o viewer.c
In file included from viewer.c:30:0:
../include/viewer.h:41:21: fatal error: ncurses.h: No such file or directory
 #include <ncurses.h>
                     ^
compilation terminated.
<builtin>: recipe for target 'viewer.o' failed
make[2]: *** [viewer.o] Error 1
make[2]: Leaving directory '/<<PKGBUILDDIR>>/src'
Makefile:55: recipe for target 'src' failed
make[1]: *** [src] Error 2
make[1]: Leaving directory '/<<PKGBUILDDIR>>'
dh_auto_build: make -j1 returned exit code 2
debian/rules:13: recipe for target 'build-arch' failed
make: *** [build-arch] Error 2

Tail of log for libsoundio on armhf:

 #error "require atomic_bool to be lock free"
  ^~~~~
cc1plus: warning: unrecognized command line option '-Wno-c99-extensions'
CMakeFiles/libsoundio_shared.dir/build.make:65: recipe for target 'CMakeFiles/libsoundio_shared.dir/src/soundio.cpp.o' failed
make[3]: *** [CMakeFiles/libsoundio_shared.dir/src/soundio.cpp.o] Error 1
make[3]: Leaving directory '/<<PKGBUILDDIR>>/obj-arm-linux-gnueabihf'
CMakeFiles/Makefile2:393: recipe for target 'CMakeFiles/libsoundio_shared.dir/all' failed
make[2]: *** [CMakeFiles/libsoundio_shared.dir/all] Error 2
make[2]: Leaving directory '/<<PKGBUILDDIR>>/obj-arm-linux-gnueabihf'
Makefile:130: recipe for target 'all' failed
make[1]: *** [all] Error 2
make[1]: Leaving directory '/<<PKGBUILDDIR>>/obj-arm-linux-gnueabihf'
dh_auto_build: make -j1 returned exit code 2
debian/rules:8: recipe for target 'build-arch' failed
make: *** [build-arch] Error 2

Tail of log for mensis on armhf:

checking for IceConnectionNumber in -lICE... yes
checking for XOpenDevice in -lXi... no
checking for XkbQueryExtension in -lxkbui... no
checking for pthread_create in -lpthread... yes
checking for u_strcpy in -lgdraw... yes
checking fontforge/basics.h usability... no
checking fontforge/basics.h presence... no
checking for fontforge/basics.h... no
You must install the include files for fontforge
before building mensis.
debian/rules:29: recipe for target 'override_dh_auto_configure' failed
make[1]: *** [override_dh_auto_configure] Error 1
make[1]: Leaving directory '/<<PKGBUILDDIR>>'
debian/rules:22: recipe for target 'build-arch' failed
make: *** [build-arch] Error 2

Tail of log for mpi-testsuite on armhf:

config.status: executing default-3 commands
config.status: executing default-4 commands
for i in `find . -name "testlist" | grep -v ^..build`; 		\
do								\
  if [ ! -e build-openmpi/$i ];				\
  then								\
    ln -s `pwd`/$i `pwd`/build-openmpi/$i;			\
  fi;								\
done
ln: failed to create symbolic link '/<<BUILDDIR>>/mpi-testsuite-3.2+dfsg/build-openmpi/./.pc/disable_large_tests.patch/group/testlist': No such file or directory
debian/rules:14: recipe for target 'override_dh_auto_configure' failed
make[1]: *** [override_dh_auto_configure] Error 1
make[1]: Leaving directory '/<<BUILDDIR>>/mpi-testsuite-3.2+dfsg'
debian/rules:7: recipe for target 'build-arch' failed
make: *** [build-arch] Error 2

Tail of log for msrtool on armhf:

sys.c: In function 'cpuid':
sys.c:40:2: error: unknown register name '%edx' in 'asm'
  asm ("cpuid" : "=b" (outebx) : "a" (0) : "%ecx", "%edx");
  ^~~
sys.c:40:2: error: unknown register name '%ecx' in 'asm'
sys.c:54:2: error: unknown register name '%edx' in 'asm'
  asm ("cpuid" : "=a" (outeax) : "a" (1) : "%ebx", "%ecx", "%edx");
  ^~~
sys.c:54:2: error: unknown register name '%ecx' in 'asm'
sys.c:54:2: error: unknown register name '%ebx' in 'asm'
<builtin>: recipe for target 'sys.o' failed
make[1]: *** [sys.o] Error 1
make[1]: Leaving directory '/<<PKGBUILDDIR>>'
/usr/share/cdbs/1/class/makefile.mk:77: recipe for target 'debian/stamp-makefile-build' failed
make: *** [debian/stamp-makefile-build] Error 2

Tail of log for ne10 on armhf:

/<<PKGBUILDDIR>>/modules/dsp/NE10_fft_int16.neonintrinsic.c:479:9: note: in expansion of macro 'RADIX8x4_LOAD'
         RADIX8x4_LOAD
         ^~~~~~~~~~~~~
modules/CMakeFiles/NE10.dir/build.make:473: recipe for target 'modules/CMakeFiles/NE10.dir/dsp/NE10_fft_int16.neonintrinsic.c.o' failed
make[3]: *** [modules/CMakeFiles/NE10.dir/dsp/NE10_fft_int16.neonintrinsic.c.o] Error 1
make[3]: Leaving directory '/<<PKGBUILDDIR>>/obj-arm-linux-gnueabihf'
CMakeFiles/Makefile2:161: recipe for target 'modules/CMakeFiles/NE10.dir/all' failed
make[2]: *** [modules/CMakeFiles/NE10.dir/all] Error 2
make[2]: Leaving directory '/<<PKGBUILDDIR>>/obj-arm-linux-gnueabihf'
Makefile:130: recipe for target 'all' failed
make[1]: *** [all] Error 2
make[1]: Leaving directory '/<<PKGBUILDDIR>>/obj-arm-linux-gnueabihf'
dh_auto_build: make -j4 returned exit code 2
debian/rules:17: recipe for target 'build-arch' failed
make: *** [build-arch] Error 2

Tail of log for nsd3 on armhf:

#define TCP_TIMEOUT 120
#define ROOT_SERVER /**/
#define INET6 /**/
#define BIND8_STATS /**/
#define NDEBUG /**/
#define RATELIMIT /**/
#define HAVE_SSL /**/

configure: exit 1
dh_auto_configure: ./configure --build=arm-linux-gnueabihf --prefix=/usr --includedir=${prefix}/include --mandir=${prefix}/share/man --infodir=${prefix}/share/info --sysconfdir=/etc --localstatedir=/var --disable-silent-rules --libexecdir=${prefix}/lib/nsd3 --disable-maintainer-mode --disable-dependency-tracking --with-configdir=/etc/nsd3 --with-nsd_conf_file=/etc/nsd3/nsd.conf --with-pidfile=/var/run/nsd3/nsd.pid --with-dbfile=/var/lib/nsd3/nsd.db --with-zonesdir=/etc/nsd3 --with-difffile=/var/lib/nsd3/ixfr.db --with-xfrdfile=/var/lib/nsd3/xfrd.state --disable-largefile --enable-root-server --enable-mmap --enable-ratelimit returned exit code 1
debian/rules:29: recipe for target 'override_dh_auto_configure' failed
make[1]: *** [override_dh_auto_configure] Error 25
make[1]: Leaving directory '/<<PKGBUILDDIR>>'
debian/rules:26: recipe for target 'build-arch' failed
make: *** [build-arch] Error 2

Tail of log for numactl on armhf:

syscall.c:209:17: error: '__NR_migrate_pages' undeclared (first use in this function)
  return syscall(__NR_migrate_pages, pid, maxnode, frommask, tomask);
                 ^~~~~~~~~~~~~~~~~~
syscall.c:209:17: note: each undeclared identifier is reported only once for each function it appears in
syscall.c:210:1: warning: control reaches end of non-void function [-Wreturn-type]
 }
 ^
Makefile:1026: recipe for target 'syscall.lo' failed
make[2]: *** [syscall.lo] Error 1
make[2]: Leaving directory '/<<PKGBUILDDIR>>'
Makefile:702: recipe for target 'all' failed
make[1]: *** [all] Error 2
make[1]: Leaving directory '/<<PKGBUILDDIR>>'
/usr/share/cdbs/1/class/makefile.mk:77: recipe for target 'debian/stamp-makefile-build' failed
make: *** [debian/stamp-makefile-build] Error 2

Tail of log for open-axiom on armhf:

#define PACKAGE_NAME "OpenAxiom"
#define PACKAGE_TARNAME "openaxiom"
#define PACKAGE_VERSION "1.5.0-2013-06-21"
#define PACKAGE_STRING "OpenAxiom 1.5.0-2013-06-21"
#define PACKAGE_BUGREPORT "open-axiom-bugs@lists.sf.net"
#define PACKAGE_URL ""
#define PACKAGE "openaxiom"
#define VERSION "1.5.0-2013-06-21"
#define OPENAXIOM_BASE_RTS Runtime::sbcl

configure: exit 1
Died at /usr/share/perl5/Debian/Debhelper/Buildsystem/autoconf.pm line 77.
	cd /<<BUILDDIR>>/open-axiom-1.5.0~svn3056+ds
debian/rules:45: recipe for target 'configure-stamp' failed
make: *** [configure-stamp] Error 25

Tail of log for openmpi1.6 on armhf:

atomic-asm.S:135: Error: selected processor does not support `dmb' in ARM mode
atomic-asm.S:136: Error: selected processor does not support `strexd r1,r6,r7,[r0]' in ARM mode
Makefile:1338: recipe for target 'atomic-asm.lo' failed
make[3]: *** [atomic-asm.lo] Error 1
make[3]: *** Waiting for unfinished jobs....
make[3]: Leaving directory '/<<PKGBUILDDIR>>/opal/asm'
Makefile:2049: recipe for target 'all-recursive' failed
make[2]: *** [all-recursive] Error 1
make[2]: Leaving directory '/<<PKGBUILDDIR>>/opal'
Makefile:1383: recipe for target 'all-recursive' failed
make[1]: *** [all-recursive] Error 1
make[1]: Leaving directory '/<<PKGBUILDDIR>>'
dh_auto_build: make -j4 returned exit code 2
debian/rules:32: recipe for target 'build-arch' failed
make: *** [build-arch] Error 2

Tail of log for orpie on armhf:

 static inline CBLAS_UPLO_t CBLAS_UPLO_val(v)
                            ^~~~~~~~~~~~~~
mlgsl_blas.h: In function 'CBLAS_DIAG_val':
mlgsl_blas.h:23:28: warning: type of 'v' defaults to 'int' [-Wimplicit-int]
 static inline CBLAS_DIAG_t CBLAS_DIAG_val(v)
                            ^~~~~~~~~~~~~~
mlgsl_blas.h: In function 'CBLAS_SIDE_val':
mlgsl_blas.h:29:28: warning: type of 'v' defaults to 'int' [-Wimplicit-int]
 static inline CBLAS_SIDE_t CBLAS_SIDE_val(v)
                            ^~~~~~~~~~~~~~
Makefile:219: recipe for target 'gsl/mlgsl_blas.o' failed
make[1]: *** [gsl/mlgsl_blas.o] Error 2
make[1]: Leaving directory '/<<PKGBUILDDIR>>'
debian/rules:21: recipe for target 'build-stamp' failed
make: *** [build-stamp] Error 2

Tail of log for ngs-sdk on armhf:

echo "DEBPKGNAME: EBPKGNAME"
DEBPKGNAME: EBPKGNAME
dh_auto_build --sourcedirectory=ngs-sdk
	make -j1
make[2]: Entering directory '/<<PKGBUILDDIR>>/ngs-sdk'
*** File 'Makefile.config.linux.armv7l' is missing. Please run ./configure
/<<PKGBUILDDIR>>/ngs-sdk/Makefile.rules:71: recipe for target 'Makefile.config.linux.armv7l' failed
make[2]: *** [Makefile.config.linux.armv7l] Error 1
make[2]: Leaving directory '/<<PKGBUILDDIR>>/ngs-sdk'
dh_auto_build: make -j1 returned exit code 2
debian/rules:41: recipe for target 'override_dh_auto_build' failed
make[1]: *** [override_dh_auto_build] Error 2
make[1]: Leaving directory '/<<PKGBUILDDIR>>'
debian/rules:19: recipe for target 'build-arch' failed
make: *** [build-arch] Error 2

Tail of log for percona-xtradb-cluster-galera-2.x on armhf:

Checking for C header file byteswap.h... yes
Checking for C header file endian.h... yes
Checking for C++ header file boost/shared_ptr.hpp... yes
Checking for C++ header file tr1/unordered_map... yes
Checking for C++ library boost_program_options... yes
Checking for __sync_fetch_and_add_8() in C library atomic... yes
Checking for C++ header file asio.hpp... yes
Checking for C++ header file asio/ssl.hpp... no
ssl support required but asio/ssl.hpp not found or not usable
compile with ssl=0 or check that openssl devel headers are usable
debian/rules:15: recipe for target 'override_dh_auto_build' failed
make[1]: *** [override_dh_auto_build] Error 1
make[1]: Leaving directory '/<<PKGBUILDDIR>>'
debian/rules:18: recipe for target 'build-arch' failed
make: *** [build-arch] Error 2

Tail of log for osrm on armhf:

 sort_blocks(InputBidIterator input_bids,
 ^
/usr/include/c++/6/bits/stl_heap.h: In function '__adjust_heap.constprop':
/usr/include/c++/6/bits/stl_heap.h:209:5: note: parameter passing for argument of type 'struct __normal_iterator' will change in GCC 7.1
     __adjust_heap(_RandomAccessIterator __first, _Distance __holeIndex,
     ^
make[3]: Leaving directory '/<<PKGBUILDDIR>>/obj-arm-linux-gnueabihf'
[ 85%] Built target osrm-extract
make[2]: Leaving directory '/<<PKGBUILDDIR>>/obj-arm-linux-gnueabihf'
Makefile:130: recipe for target 'all' failed
make[1]: *** [all] Error 2
make[1]: Leaving directory '/<<PKGBUILDDIR>>/obj-arm-linux-gnueabihf'
dh_auto_build: make -j4 returned exit code 2
debian/rules:6: recipe for target 'build-arch' failed
make: *** [build-arch] Error 2

Tail of log for networkmanagement on armhf:

/usr/include/qt4/QtCore/qmetatype.h:198:22:   required from 'int qRegisterMetaType(const char*, T*) [with T = QMap<QString, QString>]'
/<<PKGBUILDDIR>>/backends/NetworkManager/../../libs/types.h:40:1:   required from here
/usr/include/qt4/QtCore/qmap.h:178:16: warning: cast from 'char*' to 'QMap<QString, QString>::Node* {aka QMapNode<QString, QString>*}' increases required alignment of target type [-Wcast-align]
[ 93%] Linking CXX shared library ../../lib/libknm_nm.so
cd /<<PKGBUILDDIR>>/obj-arm-linux-gnueabihf/backends/NetworkManager && /usr/bin/cmake -E cmake_link_script CMakeFiles/knm_nm.dir/link.txt --verbose=1
/usr/bin/c++  -fPIC -g -O2 -fdebug-prefix-map=/<<PKGBUILDDIR>>=. -fstack-protector-strong -Wformat -Werror=format-security -Wdate-time -D_FORTIFY_SOURCE=2 -Wnon-virtual-dtor -Wno-long-long -Wundef -Wcast-align -Wchar-subscripts -Wall -W -Wpointer-arith -Wformat-security -fno-exceptions -DQT_NO_EXCEPTIONS -fno-check-new -fno-common -Woverloaded-virtual -fno-threadsafe-statics -fvisibility=hidden -Werror=return-type -fvisibility-inlines-hidden -DNDEBUG -DQT_NO_DEBUG -Wl,--enable-new-dtags -Wl,--fatal-warnings -Wl,--no-undefined -lc -Wl,-z,relro -shared -Wl,-soname,libknm_nm.so -o ../../lib/libknm_nm.so CMakeFiles/knm_nm.dir/knm_nm_automoc.o CMakeFiles/knm_nm.dir/connectiondbus.o CMakeFiles/knm_nm.dir/settingdbus.o CMakeFiles/knm_nm.dir/pbkdf2.o CMakeFiles/knm_nm.dir/wephash.o CMakeFiles/knm_nm.dir/settings/802-11-wireless-securitydbus.o CMakeFiles/knm_nm.dir/settings/802-11-wirelessdbus.o CMakeFiles/knm_nm.dir/settings/802-3-ethernetdbus.o CMakeFiles/knm_nm.dir/settings/802-1xdbus.o CMakeFiles/knm_nm.dir/settings/gsmdbus.o CMakeFiles/knm_nm.dir/settings/cdmadbus.o CMakeFiles/knm_nm.dir/settings/bluetoothdbus.o CMakeFiles/knm_nm.dir/settings/ipv4dbus.o CMakeFiles/knm_nm.dir/settings/ipv6dbus.o CMakeFiles/knm_nm.dir/settings/pppdbus.o CMakeFiles/knm_nm.dir/settings/pppoedbus.o CMakeFiles/knm_nm.dir/settings/serialdbus.o CMakeFiles/knm_nm.dir/settings/vpndbus.o CMakeFiles/knm_nm.dir/nmdbusactiveconnectionmonitor.o CMakeFiles/knm_nm.dir/nm-active-connectioninterface.o CMakeFiles/knm_nm.dir/nm-vpn-connectioninterface.o CMakeFiles/knm_nm.dir/nmdbussettingsconnectionprovider.o CMakeFiles/knm_nm.dir/nmdbussecretagent.o CMakeFiles/knm_nm.dir/nm-agent-manager.o CMakeFiles/knm_nm.dir/nm-secret-agentadaptor.o CMakeFiles/knm_nm.dir/remoteconnection.o CMakeFiles/knm_nm.dir/nm-settingsinterface.o CMakeFiles/knm_nm.dir/nm-settings-connectioninterface.o CMakeFiles/knm_nm.dir/nm-manager-interface.o CMakeFiles/knm_nm.dir/nm-device-interface.o CMakeFiles/knm_nm.dir/nm-ip4-config-interface.o CMakeFiles/knm_nm.dir/__/__/libs/service/events.o -Wl,-rpath,/<<PKGBUILDDIR>>/obj-arm-linux-gnueabihf/lib: ../../lib/libknmservice.so.4.14.26 ../../lib/libknmui.so.4.14.26 /usr/lib/arm-linux-gnueabihf/libQtNetwork.so ../../lib/libknminternals.so.4.14.26 ../../lib/libsolidcontrolfuture.so ../../lib/libsolidcontrolnm09.so.4.14.26 /usr/lib/arm-linux-gnueabihf/libQtNetwork.so /usr/lib/libkdeui.so.5.14.26 /usr/lib/arm-linux-gnueabihf/libQtGui.so /usr/lib/arm-linux-gnueabihf/libQtSvg.so /usr/lib/libkdecore.so.5.14.26 /usr/lib/arm-linux-gnueabihf/libQtDBus.so /usr/lib/arm-linux-gnueabihf/libQtCore.so -Wl,-rpath-link,/<<PKGBUILDDIR>>/obj-arm-linux-gnueabihf/lib 
make[3]: Leaving directory '/<<PKGBUILDDIR>>/obj-arm-linux-gnueabihf'
[ 93%] Built target knm_nm
make[2]: Leaving directory '/<<PKGBUILDDIR>>/obj-arm-linux-gnueabihf'
Makefile:141: recipe for target 'all' failed
make[1]: *** [all] Error 2
make[1]: Leaving directory '/<<PKGBUILDDIR>>/obj-arm-linux-gnueabihf'
dh_auto_build: make -j4 returned exit code 2
debian/rules:9: recipe for target 'build-arch' failed
make: *** [build-arch] Error 2

Tail of log for perftest on armhf:

 #warning get_cycles not implemented for this architecture: attempt asm/timex.h
  ^~~~~~~
src/get_clock.h:102:23: fatal error: asm/timex.h: No such file or directory
 #include <asm/timex.h>
                       ^
compilation terminated.
Makefile:786: recipe for target 'src/get_clock.o' failed
make[2]: *** [src/get_clock.o] Error 1
make[2]: Leaving directory '/<<BUILDDIR>>/perftest-3.4+0.6.gc3435c2'
Makefile:526: recipe for target 'all' failed
make[1]: *** [all] Error 2
make[1]: Leaving directory '/<<BUILDDIR>>/perftest-3.4+0.6.gc3435c2'
dh_auto_build: make -j1 returned exit code 2
debian/rules:7: recipe for target 'build-arch' failed
make: *** [build-arch] Error 2

Tail of log for pgloader on armhf:

;; loading file #P"/usr/share/common-lisp/source/cl-asdf/build/asdf.lisp"
;; loading system "asdf-finalizers"
;; loading system "asdf-system-connections"
;; loading system "pgloader"
Fatal SIMPLE-ERROR:
  Compilation failed: Constant
                        NIL conflicts with its asserted type
                        (VALUES UNSIGNED-BYTE &OPTIONAL).
See also:
  The SBCL Manual, Node "Handling of Types" in /usr/share/common-lisp/source/lparallel/src/cons-queue.lisp
debian/rules:31: recipe for target 'override_dh_auto_build' failed
make[1]: *** [override_dh_auto_build] Error 1
make[1]: Leaving directory '/<<BUILDDIR>>/pgloader-3.3.2+dfsg'
debian/rules:55: recipe for target 'build-arch' failed
make: *** [build-arch] Error 2

Tail of log for php-apc on armhf:

libtool: compile:  cc -I. -I/<<PKGBUILDDIR>>/APC-3.1.13 -DPHP_ATOM_INC -I/<<PKGBUILDDIR>>/APC-3.1.13/include -I/<<PKGBUILDDIR>>/APC-3.1.13/main -I/<<PKGBUILDDIR>>/APC-3.1.13 -I/usr/include/php5 -I/usr/include/php5/main -I/usr/include/php5/TSRM -I/usr/include/php5/Zend -I/usr/include/php5/ext -I/usr/include/php5/ext/date/lib -D_LARGEFILE_SOURCE -D_FILE_OFFSET_BITS=64 -DHAVE_CONFIG_H -g -O2 -c /<<PKGBUILDDIR>>/APC-3.1.13/apc_cache.c  -fPIC -DPIC -o .libs/apc_cache.o
/<<PKGBUILDDIR>>/APC-3.1.13/apc_cache.c: In function '_apc_cache_user_update':
/<<PKGBUILDDIR>>/APC-3.1.13/apc_cache.c:818:63: error: 'IS_CONSTANT_INDEX' undeclared (first use in this function)
             switch(Z_TYPE_P((*slot)->value->data.user.val) & ~IS_CONSTANT_INDEX) {
                                                               ^~~~~~~~~~~~~~~~~
/<<PKGBUILDDIR>>/APC-3.1.13/apc_cache.c:818:63: note: each undeclared identifier is reported only once for each function it appears in
/<<PKGBUILDDIR>>/APC-3.1.13/apc_cache.c:820:22: error: 'IS_CONSTANT_ARRAY' undeclared (first use in this function)
                 case IS_CONSTANT_ARRAY:
                      ^~~~~~~~~~~~~~~~~
Makefile:186: recipe for target 'apc_cache.lo' failed
make[1]: *** [apc_cache.lo] Error 1
make[1]: Leaving directory '/<<PKGBUILDDIR>>/APC-3.1.13'
cp: cannot stat 'modules/*': No such file or directory
debian/rules:48: recipe for target 'build-stamp' failed
make: *** [build-stamp] Error 1

Tail of log for pocl on armhf:

Makefile:481: recipe for target 'all-recursive' failed
make[4]: *** [all-recursive] Error 1
make[4]: Leaving directory '/<<PKGBUILDDIR>>/lib/kernel'
Makefile:465: recipe for target 'all-recursive' failed
make[3]: *** [all-recursive] Error 1
make[3]: Leaving directory '/<<PKGBUILDDIR>>/lib'
Makefile:640: recipe for target 'all-recursive' failed
make[2]: *** [all-recursive] Error 1
make[2]: Leaving directory '/<<PKGBUILDDIR>>'
Makefile:526: recipe for target 'all' failed
make[1]: *** [all] Error 2
make[1]: Leaving directory '/<<PKGBUILDDIR>>'
dh_auto_build: make -j4 returned exit code 2
debian/rules:44: recipe for target 'build-arch' failed
make: *** [build-arch] Error 2

Tail of log for prboom on armhf:

                                           ^~~~~~~~~~~~~~~
Makefile:242: recipe for target 'i_sshot.o' failed
make[4]: *** [i_sshot.o] Error 1
make[4]: Leaving directory '/<<BUILDDIR>>/prboom-2.5.0+dfsg1/src/SDL'
Makefile:460: recipe for target 'all-recursive' failed
make[3]: *** [all-recursive] Error 1
make[3]: Leaving directory '/<<BUILDDIR>>/prboom-2.5.0+dfsg1/src'
Makefile:285: recipe for target 'all-recursive' failed
make[2]: *** [all-recursive] Error 1
make[2]: Leaving directory '/<<BUILDDIR>>/prboom-2.5.0+dfsg1'
Makefile:205: recipe for target 'all' failed
make[1]: *** [all] Error 2
make[1]: Leaving directory '/<<BUILDDIR>>/prboom-2.5.0+dfsg1'
debian/rules:26: recipe for target 'build-stamp' failed
make: *** [build-stamp] Error 2

Tail of log for pyside-mobility on armhf:

  (void)argv;
#ifndef Q_WS_MAC
  return ((int*)(&Q_WS_MAC))[argc];
#else
  (void)argc;
  return 0;
#endif
}

dh_auto_configure: cmake .. -DCMAKE_INSTALL_PREFIX=/usr -DCMAKE_VERBOSE_MAKEFILE=ON -DCMAKE_BUILD_TYPE=None -DCMAKE_INSTALL_SYSCONFDIR=/etc -DCMAKE_INSTALL_LOCALSTATEDIR=/var -DCMAKE_VERBOSE_MAKEFILE=ON -DCMAKE_BUILD_TYPE:STRING=Release -DCMAKE_SKIP_RPATH=true -DCMAKE_USE_PYTHON_VERSION=2.7 -DPython_ADDITIONAL_VERSIONS=2.7 -DPythonInterp_FIND_VERSION=2.7 -DPYTHON_BASENAME=-python2.7 -DPYTHON_SUFFIX=-python2.7 returned exit code 1
debian/rules:52: recipe for target 'override_dh_auto_configure-2.7' failed
make[1]: *** [override_dh_auto_configure-2.7] Error 255
make[1]: Leaving directory '/<<BUILDDIR>>/pyside-mobility-0.2.3+git4~8118106'
debian/rules:4: recipe for target 'build-arch' failed
make: *** [build-arch] Error 2

Tail of log for qtjsbackend-opensource-src on armhf:

make[3]: *** Waiting for unfinished jobs....
Makefile:1220: recipe for target '.obj/assembler.o' failed
make[3]: *** [.obj/assembler.o] Error 1
Makefile:1072: recipe for target '.obj/api.o' failed
make[3]: *** [.obj/api.o] Error 1
make[3]: Leaving directory '/<<PKGBUILDDIR>>/src/v8'
Makefile:86: recipe for target 'sub-v8-make_first-ordered' failed
make[2]: *** [sub-v8-make_first-ordered] Error 2
make[2]: Leaving directory '/<<PKGBUILDDIR>>/src'
Makefile:43: recipe for target 'sub-src-make_first' failed
make[1]: *** [sub-src-make_first] Error 2
make[1]: Leaving directory '/<<PKGBUILDDIR>>'
dh_auto_build: make -j4 returned exit code 2
debian/rules:14: recipe for target 'build-arch' failed
make: *** [build-arch] Error 25

Tail of log for qutecsound on armhf:

src/csoundengine.cpp:795:44: error: 'struct CsoundUserData' has no member named 'channelList'
       CsoundChannelListEntry *chnls = *ud->channelList;
                                            ^~~~~~~~~~~
src/csoundengine.cpp:817:49: error: 'csoundSetInputValueCallback' was not declared in this scope
     csoundSetInputValueCallback(ud->csound, NULL);
                                                 ^
src/csoundengine.cpp:818:50: error: 'csoundSetOutputValueCallback' was not declared in this scope
     csoundSetOutputValueCallback(ud->csound, NULL);
                                                  ^
Makefile:785: recipe for target 'build/doubles/release/obj/csoundengine.o' failed
make[1]: *** [build/doubles/release/obj/csoundengine.o] Error 1
make[1]: *** Waiting for unfinished jobs....
make[1]: Leaving directory '/<<PKGBUILDDIR>>'
/usr/share/cdbs/1/class/makefile.mk:77: recipe for target 'debian/stamp-makefile-build' failed
make: *** [debian/stamp-makefile-build] Error 2

Tail of log for rt-app on armhf:

make[3]: *** Waiting for unfinished jobs....
rt-app.c: In function 'main':
rt-app.c:753:3: warning: implicit declaration of function 'sleep' [-Wimplicit-function-declaration]
   sleep(opts.duration);
   ^~~~~
make[3]: Leaving directory '/<<PKGBUILDDIR>>/src'
Makefile:311: recipe for target 'all' failed
make[2]: *** [all] Error 2
make[2]: Leaving directory '/<<PKGBUILDDIR>>/src'
Makefile:391: recipe for target 'all-recursive' failed
make[1]: *** [all-recursive] Error 1
make[1]: Leaving directory '/<<PKGBUILDDIR>>'
dh_auto_build: make -j4 returned exit code 2
debian/rules:7: recipe for target 'build-arch' failed
make: *** [build-arch] Error 2

Tail of log for pinot on armhf:

                                           ^~~~~~~~~~~~~~~~
DownloaderInterface.cpp:108:27: error: 'locksTable' was not declared in this scope
   pthread_mutex_destroy(&(locksTable[lockNum]));
                           ^~~~~~~~~~
Makefile:549: recipe for target 'libCollect_la-DownloaderInterface.lo' failed
make[3]: *** [libCollect_la-DownloaderInterface.lo] Error 1
make[3]: Leaving directory '/<<PKGBUILDDIR>>/Collect'
Makefile:559: recipe for target 'all-recursive' failed
make[2]: *** [all-recursive] Error 1
make[2]: Leaving directory '/<<PKGBUILDDIR>>'
Makefile:446: recipe for target 'all' failed
make[1]: *** [all] Error 2
make[1]: Leaving directory '/<<PKGBUILDDIR>>'
/usr/share/cdbs/1/class/makefile.mk:77: recipe for target 'debian/stamp-makefile-build' failed
make: *** [debian/stamp-makefile-build] Error 2

Tail of log for qstopmotion on armhf:

     if (args != NULL) {
              ^
CMakeFiles/qstopmotion.dir/build.make:1817: recipe for target 'CMakeFiles/qstopmotion.dir/src/technical/grabber/gphoto2/gpgrabber.cpp.o' failed
make[3]: *** [CMakeFiles/qstopmotion.dir/src/technical/grabber/gphoto2/gpgrabber.cpp.o] Error 1
make[3]: *** Waiting for unfinished jobs....
make[3]: Leaving directory '/<<PKGBUILDDIR>>/obj-arm-linux-gnueabihf'
CMakeFiles/Makefile2:70: recipe for target 'CMakeFiles/qstopmotion.dir/all' failed
make[2]: *** [CMakeFiles/qstopmotion.dir/all] Error 2
make[2]: Leaving directory '/<<PKGBUILDDIR>>/obj-arm-linux-gnueabihf'
Makefile:152: recipe for target 'all' failed
make[1]: *** [all] Error 2
make[1]: Leaving directory '/<<PKGBUILDDIR>>/obj-arm-linux-gnueabihf'
dh_auto_build: make -j4 returned exit code 2
debian/rules:16: recipe for target 'build-arch' failed
make: *** [build-arch] Error 2

Tail of log for ruby2.1 on armhf:

gcc -shared -o ../../.ext/arm-linux-gnueabihf/pathname.so pathname.o -L. -L../.. -L. -Wl,-z,relro -L/<<PKGBUILDDIR>>/debian/lib -fstack-protector -rdynamic -Wl,-export-dynamic    -lruby-2.1  -lpthread -lgmp -ldl -lcrypt -lm   -lc
make[4]: Leaving directory '/<<PKGBUILDDIR>>/ext/pathname'
rm -f ../../.ext/arm-linux-gnueabihf/nkf.so
gcc -shared -o ../../.ext/arm-linux-gnueabihf/nkf.so nkf.o -L. -L../.. -L. -Wl,-z,relro -L/<<PKGBUILDDIR>>/debian/lib -fstack-protector -rdynamic -Wl,-export-dynamic    -lruby-2.1  -lpthread -lgmp -ldl -lcrypt -lm   -lc
make[4]: Leaving directory '/<<PKGBUILDDIR>>/ext/nkf'
make[3]: Leaving directory '/<<PKGBUILDDIR>>'
uncommon.mk:180: recipe for target 'build-ext' failed
make[2]: *** [build-ext] Error 2
make[2]: Leaving directory '/<<PKGBUILDDIR>>'
dh_auto_build: make -j4 main V=1 returned exit code 2
debian/rules:67: recipe for target 'override_dh_auto_build-arch' failed
make[1]: *** [override_dh_auto_build-arch] Error 2
make[1]: Leaving directory '/<<PKGBUILDDIR>>'
debian/rules:49: recipe for target 'build-arch' failed
make: *** [build-arch] Error 2

Tail of log for slang-slirp on armhf:

checking for dlopen in -ldl... yes
checking for g++... g++
checking whether we are using the GNU C++ compiler... yes
checking whether g++ accepts -g... yes
checking for gfortran... gfortran
checking whether we are using the GNU Fortran compiler... yes
checking whether gfortran accepts -g... yes
checking how to get verbose linking output from gfortran... -v
checking for Fortran libraries of gfortran...  -L/usr/lib/gcc/arm-linux-gnueabihf/6 -L/usr/lib/gcc/arm-linux-gnueabihf/6/../../../arm-linux-gnueabihf -L/usr/lib/gcc/arm-linux-gnueabihf/6/../../.. -L/lib/arm-linux-gnueabihf -L/usr/lib/arm-linux-gnueabihf -lgfortran -lm
checking for dummy main to link with Fortran libraries... none
checking for Fortran name-mangling scheme... lower case, underscore, no extra underscore
checking for the slang library and header files ... no
configure: error: unable to find the slang library and header file slang.h
/usr/share/cdbs/1/class/autotools.mk:44: recipe for target 'debian/stamp-autotools' failed
make: *** [debian/stamp-autotools] Error 1

Tail of log for sortmerna on armhf:

touch index/.tobuild
dh_auto_build
	make -j1
make[2]: Entering directory '/<<PKGBUILDDIR>>'
gcc -DHAVE_CONFIG_H -I. -I./include   -Wdate-time -D_FORTIFY_SOURCE=2  -g -O2 -fdebug-prefix-map=/<<PKGBUILDDIR>>=. -fstack-protector-strong -Wformat -Werror=format-security -pipe -funroll-loops -msse2 -Wall -fopenmp -c -o cmph/bdz.o cmph/bdz.c
gcc: error: unrecognized command line option '-msse2'
Makefile:644: recipe for target 'cmph/bdz.o' failed
make[2]: *** [cmph/bdz.o] Error 1
make[2]: Leaving directory '/<<PKGBUILDDIR>>'
dh_auto_build: make -j1 returned exit code 2
debian/rules:25: recipe for target 'override_dh_auto_build' failed
make[1]: *** [override_dh_auto_build] Error 2
make[1]: Leaving directory '/<<PKGBUILDDIR>>'
debian/rules:13: recipe for target 'build-arch' failed
make: *** [build-arch] Error 2

Tail of log for snap-aligner on armhf:

     ^~~
/usr/include/c++/6/bits/stl_algobase.h:219:5: note:   template argument deduction/substitution failed:
SNAPLib/SortedDataWriter.cpp:338:70: note:   deduced conflicting types for parameter 'const _Tp' ('long unsigned int' and '_int64 {aka long long int}')
             min(1UL << 23, max(1UL << 17, bufferSpace / blocks.size()))); // 128kB to 8MB buffer space per block
                                                                      ^
<builtin>: recipe for target 'SNAPLib/SortedDataWriter.o' failed
make[2]: *** [SNAPLib/SortedDataWriter.o] Error 1
make[2]: *** Waiting for unfinished jobs....
make[2]: Leaving directory '/<<BUILDDIR>>/snap-aligner-1.0~beta.18+dfsg'
dh_auto_build: make -j4 returned exit code 2
debian/rules:18: recipe for target 'override_dh_auto_build' failed
make[1]: *** [override_dh_auto_build] Error 2
make[1]: Leaving directory '/<<BUILDDIR>>/snap-aligner-1.0~beta.18+dfsg'
debian/rules:11: recipe for target 'build-arch' failed
make: *** [build-arch] Error 2

Tail of log for tlsdate on armhf:

/usr/include/openssl/ssl.h:1614:1: note: declared here
 DEPRECATEDIN_1_1_0(__owur const SSL_METHOD *TLSv1_client_method(void)) /* TLSv1.0 */
 ^
src/tlsdate-helper.c:1207:27: error: dereferencing pointer to incomplete type 'SSL {aka struct ssl_st}'
   memcpy(&result_time, ssl->s3->server_random, sizeof (uint32_t));
                           ^~
Makefile:1973: recipe for target 'src/src_tlsdate_helper-tlsdate-helper.o' failed
make[2]: *** [src/src_tlsdate_helper-tlsdate-helper.o] Error 1
make[2]: Leaving directory '/<<PKGBUILDDIR>>'
Makefile:1367: recipe for target 'all' failed
make[1]: *** [all] Error 2
make[1]: Leaving directory '/<<PKGBUILDDIR>>'
dh_auto_build: make -j1 returned exit code 2
debian/rules:25: recipe for target 'build-arch' failed
make: *** [build-arch] Error 2

Tail of log for ulogd on armhf:

make[2]: Entering directory '/<<PKGBUILDDIR>>/libipulog'
gcc -g -O2  -Wall -DULOGD_CONFIGFILE=\"/etc/ulogd.conf\" -D_FILE_OFFSET_BITS=64 -I./debian/include -Iinclude -I/usr/src/linux/include -c libipulog.c -o libipulog.o
In file included from libipulog.c:32:0:
include/libipulog/libipulog.h:15:43: fatal error: linux/netfilter_ipv4/ipt_ULOG.h: No such file or directory
 #include <linux/netfilter_ipv4/ipt_ULOG.h>
                                           ^
compilation terminated.
Makefile:15: recipe for target 'libipulog.o' failed
make[2]: *** [libipulog.o] Error 1
make[2]: Leaving directory '/<<PKGBUILDDIR>>/libipulog'
Makefile:63: recipe for target 'recurse' failed
make[1]: *** [recurse] Error 1
make[1]: Leaving directory '/<<PKGBUILDDIR>>'
/usr/share/cdbs/1/class/makefile.mk:77: recipe for target 'debian/stamp-makefile-build' failed
make: *** [debian/stamp-makefile-build] Error 2

Tail of log for varnish-agent on armhf:

src/Makefile.am:8: but option 'subdir-objects' is disabled
src/Makefile.am:8: warning: source file 'modules/vban.c' is in a subdirectory,
src/Makefile.am:8: but option 'subdir-objects' is disabled
src/Makefile.am:8: warning: source file 'modules/curl.c' is in a subdirectory,
src/Makefile.am:8: but option 'subdir-objects' is disabled
src/Makefile.am:8: warning: source file 'modules/vdirect.c' is in a subdirectory,
src/Makefile.am:8: but option 'subdir-objects' is disabled
src/Makefile.am:8: warning: source file 'modules/vac_register.c' is in a subdirectory,
src/Makefile.am:8: but option 'subdir-objects' is disabled
src/Makefile.am: installing './depcomp'
parallel-tests: installing './test-driver'
autoreconf: automake failed with exit status: 1
dh_autoreconf: autoreconf -f -i returned exit code 1
debian/rules:46: recipe for target 'build-arch' failed
make: *** [build-arch] Error 2

Tail of log for tarantool on armhf:

/<<PKGBUILDDIR>>/third_party/coro/coro.c:479:14: note: each undeclared identifier is reported only once for each function it appears in
/<<PKGBUILDDIR>>/third_party/coro/coro.c:493:4: error: #error unsupported architecture
   #error unsupported architecture
    ^~~~~
CMakeFiles/coro.dir/build.make:65: recipe for target 'CMakeFiles/coro.dir/third_party/coro/coro.c.o' failed
make[3]: *** [CMakeFiles/coro.dir/third_party/coro/coro.c.o] Error 1
make[3]: Leaving directory '/<<PKGBUILDDIR>>/obj-arm-linux-gnueabihf'
CMakeFiles/Makefile2:384: recipe for target 'CMakeFiles/coro.dir/all' failed
make[2]: *** [CMakeFiles/coro.dir/all] Error 2
make[2]: Leaving directory '/<<PKGBUILDDIR>>/obj-arm-linux-gnueabihf'
Makefile:152: recipe for target 'all' failed
make[1]: *** [all] Error 2
make[1]: Leaving directory '/<<PKGBUILDDIR>>/obj-arm-linux-gnueabihf'
/usr/share/cdbs/1/class/makefile.mk:77: recipe for target 'debian/stamp-makefile-build' failed
make: *** [debian/stamp-makefile-build] Error 2

Tail of log for wiredtiger on armhf:

make[3]: *** Waiting for unfinished jobs....
Makefile:1837: recipe for target 'src/async/async_op.lo' failed
make[3]: *** [src/async/async_op.lo] Error 1
Makefile:1837: recipe for target 'src/async/async_api.lo' failed
make[3]: *** [src/async/async_api.lo] Error 1
make[3]: Leaving directory '/<<BUILDDIR>>/wiredtiger-2.6.1+ds'
Makefile:1997: recipe for target 'all-recursive' failed
make[2]: *** [all-recursive] Error 1
make[2]: Leaving directory '/<<BUILDDIR>>/wiredtiger-2.6.1+ds'
Makefile:921: recipe for target 'all' failed
make[1]: *** [all] Error 2
make[1]: Leaving directory '/<<BUILDDIR>>/wiredtiger-2.6.1+ds'
dh_auto_build: make -j4 returned exit code 2
debian/rules:21: recipe for target 'build-arch' failed
make: *** [build-arch] Error 2

Tail of log for wmmail on armhf:

make[2]: Entering directory '/<<PKGBUILDDIR>>/src'
gcc -DPACKAGE=\"WMMail\" -DVERSION=\"0.64\" -DHAVE_LIBNSL=1 -DHAVE_LIBX11=1 -DHAVE_LIBXEXT=1 -DHAVE_LIBXT=1 -DHAVE_LIBXPM=1 -DHAVE_LIBWUTIL=1 -DSTDC_HEADERS=1 -DHAVE_LIMITS_H=1 -DHAVE_STRINGS_H=1 -DHAVE_UNISTD_H=1 -DRETSIGTYPE=int -DHAVE_VPRINTF=1 -DHAVE_SOCKET=1 -DHAVE_STRSTR=1  -I. -I.      -g -O2 -I  -c global.c
In file included from global.c:27:0:
wmmail.h:32:35: fatal error: WINGs/proplist-compat.h: No such file or directory
 #include <WINGs/proplist-compat.h>
                                   ^
compilation terminated.
Makefile:247: recipe for target 'global.o' failed
make[2]: *** [global.o] Error 1
make[2]: Leaving directory '/<<PKGBUILDDIR>>/src'
Makefile:125: recipe for target 'all-recursive' failed
make[1]: *** [all-recursive] Error 1
make[1]: Leaving directory '/<<PKGBUILDDIR>>'
debian/rules:13: recipe for target 'build-stamp' failed
make: *** [build-stamp] Error 2

Tail of log for xf86-video-msm on armhf:

/usr/include/xorg/servermd.h:52:2: error: #error xserver code must include dix-config.h before any other headers
 #error xserver code must include dix-config.h before any other headers
  ^~~~~
Makefile:534: recipe for target 'neon_memsets.lo' failed
make[3]: *** [neon_memsets.lo] Error 1
make[3]: Leaving directory '/<<BUILDDIR>>/xf86-video-msm-1.0.1+git20100122.5f7df591/src'
Makefile:426: recipe for target 'all-recursive' failed
make[2]: *** [all-recursive] Error 1
make[2]: Leaving directory '/<<BUILDDIR>>/xf86-video-msm-1.0.1+git20100122.5f7df591'
Makefile:358: recipe for target 'all' failed
make[1]: *** [all] Error 2
make[1]: Leaving directory '/<<BUILDDIR>>/xf86-video-msm-1.0.1+git20100122.5f7df591'
dh_auto_build: make -j1 returned exit code 2
debian/rules:8: recipe for target 'build-arch' failed
make: *** [build-arch] Error 2

Tail of log for yp-tools on armhf:

     status = ypprot_err (((struct ypresp_val *) resp)->status);
                           ^
cc1: all warnings being treated as errors
Makefile:541: recipe for target 'do_ypcall.lo' failed
make[3]: *** [do_ypcall.lo] Error 1
make[3]: Leaving directory '/<<PKGBUILDDIR>>/lib'
Makefile:485: recipe for target 'all-recursive' failed
make[2]: *** [all-recursive] Error 1
make[2]: Leaving directory '/<<PKGBUILDDIR>>'
Makefile:393: recipe for target 'all' failed
make[1]: *** [all] Error 2
make[1]: Leaving directory '/<<PKGBUILDDIR>>'
dh_auto_build: make -j1 returned exit code 2
debian/rules:22: recipe for target 'build-arch' failed
make: *** [build-arch] Error 2

Tail of log for sdrangelove on armhf:

    Feature record: CXX_FEATURE:0cxx_static_assert
    Feature record: CXX_FEATURE:0cxx_strong_enums
    Feature record: CXX_FEATURE:1cxx_template_template_parameters
    Feature record: CXX_FEATURE:0cxx_thread_local
    Feature record: CXX_FEATURE:0cxx_trailing_return_types
    Feature record: CXX_FEATURE:0cxx_unicode_literals
    Feature record: CXX_FEATURE:0cxx_uniform_initialization
    Feature record: CXX_FEATURE:0cxx_unrestricted_unions
    Feature record: CXX_FEATURE:0cxx_user_literals
    Feature record: CXX_FEATURE:0cxx_variable_templates
    Feature record: CXX_FEATURE:0cxx_variadic_macros
    Feature record: CXX_FEATURE:0cxx_variadic_templates
dh_auto_configure: cmake .. -DCMAKE_INSTALL_PREFIX=/usr -DCMAKE_VERBOSE_MAKEFILE=ON -DCMAKE_BUILD_TYPE=None -DCMAKE_INSTALL_SYSCONFDIR=/etc -DCMAKE_INSTALL_LOCALSTATEDIR=/var returned exit code 1
debian/rules:14: recipe for target 'build-arch' failed
make: *** [build-arch] Error 2

Tail of log for wesnoth-1.8 on armhf:

	config/py-compile config.log
find po -name "*.gmo" -exec rm -f {} \;
find po -name "stamp-po" -exec rm -f {} \;
rm -f config.sub config.guess
/usr/bin/make -f /usr/share/quilt/quilt.make unpatch
make[1]: Entering directory '/<<PKGBUILDDIR>>'
QUILT_PATCHES=debian/patches \
	quilt --quiltrc /dev/null pop -a -R || test $? = 2
No patch removed
rm -rf .pc debian/stamp-patched
make[1]: Leaving directory '/<<PKGBUILDDIR>>'
dh_clean
dh_clean: Compatibility levels before 9 are deprecated (level 7 in use)
 debian/rules build-arch
make: *** No rule to make target 'build-arch'.  Stop.

Tail of log for xhprof on armhf:

/<<PKGBUILDDIR>>/extension/xhprof.c:24:0: note: this is the location of the previous definition
 # define _GNU_SOURCE
 
/<<PKGBUILDDIR>>/extension/xhprof.c:825:10: warning: 'hp_globals' is static but used in inline function 'hp_ignore_entry' which is not static
   return hp_globals.ignored_function_names != NULL &&
          ^~~~~~~~~~
/<<PKGBUILDDIR>>/extension/xhprof.c: In function 'hp_mode_hier_beginfn_cb':
/<<PKGBUILDDIR>>/extension/xhprof.c:1224:3: error: impossible constraint in 'asm'
   asm volatile("rdtsc" : "=a" (__a), "=d" (__d));
   ^~~
Makefile:180: recipe for target 'xhprof.lo' failed
make[1]: *** [xhprof.lo] Error 1
make[1]: Leaving directory '/<<PKGBUILDDIR>>/extension'
debian/rules:37: recipe for target 'build-stamp' failed
make: *** [build-stamp] Error 2

Tail of log for 3dldf on armhf:

terminate called after throwing an instance of 'std::bad_alloc'
  what():  std::bad_alloc
./runit: line 76:  5620 Aborted                 (core dumped) ./3dldf sample2.ldf
Makefile:1678: recipe for target 'sample2.mp' failed
make[3]: *** [sample2.mp] Error 134
make[3]: Leaving directory '/<<BUILDDIR>>/3dldf-2.0.3+dfsg/src'
Makefile:786: recipe for target 'check-am' failed
make[2]: *** [check-am] Error 2
make[2]: Leaving directory '/<<BUILDDIR>>/3dldf-2.0.3+dfsg/src'
Makefile:546: recipe for target 'check-recursive' failed
make[1]: *** [check-recursive] Error 1
make[1]: Leaving directory '/<<BUILDDIR>>/3dldf-2.0.3+dfsg'
dh_auto_test: make -j1 check VERBOSE=1 returned exit code 2
debian/rules:9: recipe for target 'build-arch' failed
make: *** [build-arch] Error 2

Tail of log for monav on armhf:

compilation terminated.
Makefile.preprocessor-gui.preprocessor_plugins.mapnikrenderer:234: recipe for target 'mapnikrenderer.o' failed
make[4]: *** [mapnikrenderer.o] Error 1
make[4]: Leaving directory '/<<PKGBUILDDIR>>/plugins/osmrenderer'
Makefile.preprocessor-gui.preprocessor_plugins:112: recipe for target 'sub-osmrenderer-mapnikrenderer-pro-make_default' failed
make[3]: *** [sub-osmrenderer-mapnikrenderer-pro-make_default] Error 2
make[3]: Leaving directory '/<<PKGBUILDDIR>>/plugins'
Makefile.preprocessor-gui:62: recipe for target 'sub-plugins-preprocessor_plugins-pro-make_default' failed
make[2]: *** [sub-plugins-preprocessor_plugins-pro-make_default] Error 2
make[2]: Leaving directory '/<<PKGBUILDDIR>>'
debian/rules:31: recipe for target 'override_dh_auto_build' failed
make[1]: *** [override_dh_auto_build] Error 2
make[1]: Leaving directory '/<<PKGBUILDDIR>>'
debian/rules:53: recipe for target 'build-arch' failed
make: *** [build-arch] Error 2

Tail of log for slic3r-prusa on armhf:

t/support.t                      (Wstat: 1280 Tests: 24 Failed: 5)
  Failed tests:  14, 17-20
  Non-zero exit status: 5
  Parse errors: Tests out of sequence.  Found (22) but expected (21)
                Tests out of sequence.  Found (25) but expected (22)
                Tests out of sequence.  Found (26) but expected (23)
                Tests out of sequence.  Found (27) but expected (24)
                Bad plan.  You planned 27 tests but ran 24.
Files=53, Tests=900, 235 wallclock secs ( 0.54 usr  0.24 sys + 160.54 cusr 104.96 csys = 266.28 CPU)
Result: FAIL
debian/rules:26: recipe for target 'override_dh_auto_test' failed
make[1]: *** [override_dh_auto_test] Error 1
make[1]: Leaving directory '/<<PKGBUILDDIR>>'
debian/rules:11: recipe for target 'build-arch' failed
make: *** [build-arch] Error 2

Tail of log for rivet on armhf:

Makefile:873: recipe for target 'test-suite.log' failed
make[4]: *** [test-suite.log] Error 1
make[4]: Leaving directory '/<<PKGBUILDDIR>>/test'
Makefile:979: recipe for target 'check-TESTS' failed
make[3]: *** [check-TESTS] Error 2
make[3]: Leaving directory '/<<PKGBUILDDIR>>/test'
Makefile:1094: recipe for target 'check-am' failed
make[2]: *** [check-am] Error 2
make[2]: Leaving directory '/<<PKGBUILDDIR>>/test'
Makefile:494: recipe for target 'check-recursive' failed
make[1]: *** [check-recursive] Error 1
make[1]: Leaving directory '/<<PKGBUILDDIR>>'
dh_auto_test: make -j4 check VERBOSE=1 returned exit code 2
debian/rules:28: recipe for target 'build-arch' failed
make: *** [build-arch] Error 2

Tail of log for cone on armhf:

make[5]: Leaving directory '/<<PKGBUILDDIR>>/cone'
Makefile:970: recipe for target 'all-recursive' failed
make[4]: *** [all-recursive] Error 1
make[4]: Leaving directory '/<<PKGBUILDDIR>>/cone'
Makefile:617: recipe for target 'all' failed
make[3]: *** [all] Error 2
make[3]: Leaving directory '/<<PKGBUILDDIR>>/cone'
Makefile:370: recipe for target 'all-recursive' failed
make[2]: *** [all-recursive] Error 1
make[2]: Leaving directory '/<<PKGBUILDDIR>>'
Makefile:275: recipe for target 'all' failed
make[1]: *** [all] Error 2
make[1]: Leaving directory '/<<PKGBUILDDIR>>'
/usr/share/cdbs/1/class/makefile.mk:77: recipe for target 'debian/stamp-makefile-build' failed
make: *** [debian/stamp-makefile-build] Error 2

Tail of log for sflphone on armhf:

make[5]: Leaving directory '/<<PKGBUILDDIR>>/daemon/src/video'
Makefile:754: recipe for target 'all-recursive' failed
make[4]: *** [all-recursive] Error 1
make[4]: Leaving directory '/<<PKGBUILDDIR>>/daemon/src'
Makefile:514: recipe for target 'all-recursive' failed
make[3]: *** [all-recursive] Error 1
make[3]: Leaving directory '/<<PKGBUILDDIR>>/daemon'
Makefile:445: recipe for target 'all' failed
make[2]: *** [all] Error 2
make[2]: Leaving directory '/<<PKGBUILDDIR>>/daemon'
debian/rules:24: recipe for target 'override_dh_auto_build' failed
make[1]: *** [override_dh_auto_build] Error 2
make[1]: Leaving directory '/<<PKGBUILDDIR>>'
debian/rules:9: recipe for target 'build-arch' failed
make: *** [build-arch] Error 2

Tail of log for firefox on armhf:

DEBUG: configure:21027: /usr/bin/gcc-5 -std=gnu99 -o conftest -fstack-protector-strong -Wformat -Werror=format-security -fno-strict-aliasing -ffunction-sections -fdata-sections -fno-math-errno -pthread -pipe -I/usr/include/freetype2 -Wdate-time -D_FORTIFY_SOURCE=2 -lpthread -Wl,--as-needed -Wl,--reduce-memory-overheads -Wl,--no-keep-memory -Wl,--stats -Wl,-z,noexecstack -Wl,-z,text -Wl,--build-id conftest.c -ldl  -lfreetype 1>&5
DEBUG: /usr/bin/ld: total time in link: 0.056000
DEBUG: /usr/bin/ld: data size 2961408
DEBUG: configure:21065: checking for fontconfig/fcfreetype.h
DEBUG: configure:21078: /usr/bin/gcc-5 -std=gnu99 -c -fstack-protector-strong -Wformat -Werror=format-security -fno-strict-aliasing -ffunction-sections -fdata-sections -fno-math-errno -pthread -pipe -Wdate-time -D_FORTIFY_SOURCE=2 -I/usr/include/freetype2  conftest.c 1>&5
DEBUG: configure:21129: checking for fontconfig >= 2.7.0
DEBUG: configure:21136: checking _FONTCONFIG_CFLAGS
DEBUG: configure:21141: checking _FONTCONFIG_LIBS
DEBUG: configure: error: cannot determine icu version number from uvernum.h header file
ERROR: old-configure failed
debian/rules:215: recipe for target 'stamps/configure-browser' failed
make[1]: *** [stamps/configure-browser] Error 1
make[1]: Leaving directory '/<<PKGBUILDDIR>>'
debian/rules:388: recipe for target 'build-arch' failed
make: *** [build-arch] Error 2

Tail of log for iceweasel on armhf:

configure:29808: checking for posix_fadvise
configure:29840: gcc -o conftest -Wall -Wempty-body -Wpointer-to-int-cast -Wsign-compare -Wtype-limits -Wno-unused -fstack-protector-strong -Wformat -Werror=format-security -std=gnu99 -fgnu89-inline -fno-strict-aliasing -ffunction-sections -fdata-sections -fno-math-errno -pthread -pipe -Wdate-time -D_FORTIFY_SOURCE=2 -lpthread  -Wl,--as-needed -Wl,--reduce-memory-overheads -Wl,--no-keep-memory -Wl,--stats -Wl,-z,noexecstack -Wl,-z,text -Wl,--build-id conftest.c -ldl  1>&5
/usr/bin/ld: total time in link: 0.152000
/usr/bin/ld: data size 2506752
configure:29808: checking for posix_fallocate
configure:29840: gcc -o conftest -Wall -Wempty-body -Wpointer-to-int-cast -Wsign-compare -Wtype-limits -Wno-unused -fstack-protector-strong -Wformat -Werror=format-security -std=gnu99 -fgnu89-inline -fno-strict-aliasing -ffunction-sections -fdata-sections -fno-math-errno -pthread -pipe -Wdate-time -D_FORTIFY_SOURCE=2 -lpthread  -Wl,--as-needed -Wl,--reduce-memory-overheads -Wl,--no-keep-memory -Wl,--stats -Wl,-z,noexecstack -Wl,-z,text -Wl,--build-id conftest.c -ldl  1>&5
/usr/bin/ld: total time in link: 0.156000
/usr/bin/ld: data size 2506752
configure:29894: gcc -c -Wall -Wempty-body -Wpointer-to-int-cast -Wsign-compare -Wtype-limits -Wno-unused -fstack-protector-strong -Wformat -Werror=format-security -std=gnu99 -fgnu89-inline -fno-strict-aliasing -ffunction-sections -fdata-sections -fno-math-errno -pthread -pipe  -Wdate-time -D_FORTIFY_SOURCE=2 conftest.c 1>&5
configure: error: cannot determine icu version number from uvernum.h header file 
debian/rules:212: recipe for target 'stamps/configure-browser' failed
make[1]: *** [stamps/configure-browser] Error 1
make[1]: Leaving directory '/<<PKGBUILDDIR>>'
debian/rules:393: recipe for target 'build-arch' failed
make: *** [build-arch] Error 2

Tail of log for tulip on armhf:

cd /<<PKGBUILDDIR>>/obj-arm-linux-gnueabihf/thirdparty/OGDF && /usr/bin/cmake -E cmake_link_script CMakeFiles/OGDF-tulip-4.8.dir/link.txt --verbose=1
/usr/bin/c++  -fPIC -g -O2 -fdebug-prefix-map=/<<PKGBUILDDIR>>=. -fstack-protector-strong -Wformat -Werror=format-security -Wdate-time -D_FORTIFY_SOURCE=2 -Wall -Wextra -Wunused -Wno-long-long -pedantic -w  -DOGDF_DLL -DOGDF_INSTALL -DCLP_BUILD -DCOINUTILS_BUILD -DOSI_BUILD -DSYMPHONY_BUILD -D__OSI_CLP__ -DCOMPILE_IN_CG -DCOMPILE_IN_CP -DCOMPILE_IN_LP -DCOMPILE_IN_TM -DUSE_CGL_CUTS -DHAVE_CONFIG_H -Wl,-z,relro -shared -Wl,-soname,libOGDF-tulip-4.8.so.0 -o libOGDF-tulip-4.8.so.0 CMakeFiles/OGDF-tulip-4.8.dir/src/coin/Cgl/CglAllDifferent.cpp.o CMakeFiles/OGDF-tulip-4.8.dir/src/coin/Cgl/CglClique.cpp.o CMakeFiles/OGDF-tulip-4.8.dir/src/coin/Cgl/CglCliqueHelper.cpp.o CMakeFiles/OGDF-tulip-4.8.dir/src/coin/Cgl/CglCliqueTest.cpp.o CMakeFiles/OGDF-tulip-4.8.dir/src/coin/Cgl/CglCutGenerator.cpp.o CMakeFiles/OGDF-tulip-4.8.dir/src/coin/Cgl/CglDuplicateRow.cpp.o CMakeFiles/OGDF-tulip-4.8.dir/src/coin/Cgl/CglFlowCover.cpp.o CMakeFiles/OGDF-tulip-4.8.dir/src/coin/Cgl/CglFlowCoverTest.cpp.o CMakeFiles/OGDF-tulip-4.8.dir/src/coin/Cgl/CglGomory.cpp.o CMakeFiles/OGDF-tulip-4.8.dir/src/coin/Cgl/CglGomoryTest.cpp.o CMakeFiles/OGDF-tulip-4.8.dir/src/coin/Cgl/CglKnapsackCover.cpp.o CMakeFiles/OGDF-tulip-4.8.dir/src/coin/Cgl/CglKnapsackCoverTest.cpp.o CMakeFiles/OGDF-tulip-4.8.dir/src/coin/Cgl/CglLandP.cpp.o CMakeFiles/OGDF-tulip-4.8.dir/src/coin/Cgl/CglLandPMessages.cpp.o CMakeFiles/OGDF-tulip-4.8.dir/src/coin/Cgl/CglLandPSimplex.cpp.o CMakeFiles/OGDF-tulip-4.8.dir/src/coin/Cgl/CglLandPTabRow.cpp.o CMakeFiles/OGDF-tulip-4.8.dir/src/coin/Cgl/CglLandPTest.cpp.o CMakeFiles/OGDF-tulip-4.8.dir/src/coin/Cgl/CglLandPUtils.cpp.o CMakeFiles/OGDF-tulip-4.8.dir/src/coin/Cgl/CglLandPValidator.cpp.o CMakeFiles/OGDF-tulip-4.8.dir/src/coin/Cgl/CglLiftAndProject.cpp.o CMakeFiles/OGDF-tulip-4.8.dir/src/coin/Cgl/CglMessage.cpp.o CMakeFiles/OGDF-tulip-4.8.dir/src/coin/Cgl/CglMixedIntegerRounding.cpp.o CMakeFiles/OGDF-tulip-4.8.dir/src/coin/Cgl/CglMixedIntegerRounding2.cpp.o CMakeFiles/OGDF-tulip-4.8.dir/src/coin/Cgl/CglMixedIntegerRounding2Test.cpp.o CMakeFiles/OGDF-tulip-4.8.dir/src/coin/Cgl/CglMixedIntegerRoundingTest.cpp.o CMakeFiles/OGDF-tulip-4.8.dir/src/coin/Cgl/CglOddHole.cpp.o CMakeFiles/OGDF-tulip-4.8.dir/src/coin/Cgl/CglOddHoleTest.cpp.o CMakeFiles/OGDF-tulip-4.8.dir/src/coin/Cgl/CglParam.cpp.o CMakeFiles/OGDF-tulip-4.8.dir/src/coin/Cgl/CglPreProcess.cpp.o CMakeFiles/OGDF-tulip-4.8.dir/src/coin/Cgl/CglProbing.cpp.o CMakeFiles/OGDF-tulip-4.8.dir/src/coin/Cgl/CglProbingTest.cpp.o CMakeFiles/OGDF-tulip-4.8.dir/src/coin/Cgl/CglRedSplit.cpp.o CMakeFiles/OGDF-tulip-4.8.dir/src/coin/Cgl/CglRedSplitParam.cpp.o CMakeFiles/OGDF-tulip-4.8.dir/src/coin/Cgl/CglRedSplitTest.cpp.o CMakeFiles/OGDF-tulip-4.8.dir/src/coin/Cgl/CglResidualCapacity.cpp.o CMakeFiles/OGDF-tulip-4.8.dir/src/coin/Cgl/CglResidualCapacityTest.cpp.o CMakeFiles/OGDF-tulip-4.8.dir/src/coin/Cgl/CglSimpleRounding.cpp.o CMakeFiles/OGDF-tulip-4.8.dir/src/coin/Cgl/CglSimpleRoundingTest.cpp.o CMakeFiles/OGDF-tulip-4.8.dir/src/coin/Cgl/CglStored.cpp.o CMakeFiles/OGDF-tulip-4.8.dir/src/coin/Cgl/CglTreeInfo.cpp.o CMakeFiles/OGDF-tulip-4.8.dir/src/coin/Cgl/CglTwomir.cpp.o CMakeFiles/OGDF-tulip-4.8.dir/src/coin/Cgl/CglTwomirTest.cpp.o CMakeFiles/OGDF-tulip-4.8.dir/src/coin/Clp/ClpCholeskyBase.cpp.o CMakeFiles/OGDF-tulip-4.8.dir/src/coin/Clp/ClpCholeskyDense.cpp.o CMakeFiles/OGDF-tulip-4.8.dir/src/coin/Clp/ClpCholeskyTaucs.cpp.o CMakeFiles/OGDF-tulip-4.8.dir/src/coin/Clp/ClpConstraint.cpp.o CMakeFiles/OGDF-tulip-4.8.dir/src/coin/Clp/ClpConstraintLinear.cpp.o CMakeFiles/OGDF-tulip-4.8.dir/src/coin/Clp/ClpConstraintQuadratic.cpp.o CMakeFiles/OGDF-tulip-4.8.dir/src/coin/Clp/ClpDualRowDantzig.cpp.o CMakeFiles/OGDF-tulip-4.8.dir/src/coin/Clp/ClpDualRowPivot.cpp.o CMakeFiles/OGDF-tulip-4.8.dir/src/coin/Clp/ClpDualRowSteepest.cpp.o CMakeFiles/OGDF-tulip-4.8.dir/src/coin/Clp/ClpDummyMatrix.cpp.o CMakeFiles/OGDF-tulip-4.8.dir/src/coin/Clp/ClpDynamicExampleMatrix.cpp.o CMakeFiles/OGDF-tulip-4.8.dir/src/coin/Clp/ClpDynamicMatrix.cpp.o CMakeFiles/OGDF-tulip-4.8.dir/src/coin/Clp/ClpEventHandler.cpp.o CMakeFiles/OGDF-tulip-4.8.dir/src/coin/Clp/ClpFactorization.cpp.o CMakeFiles/OGDF-tulip-4.8.dir/src/coin/Clp/ClpGubDynamicMatrix.cpp.o CMakeFiles/OGDF-tulip-4.8.dir/src/coin/Clp/ClpGubMatrix.cpp.o CMakeFiles/OGDF-tulip-4.8.dir/src/coin/Clp/ClpHelperFunctions.cpp.o CMakeFiles/OGDF-tulip-4.8.dir/src/coin/Clp/ClpInterior.cpp.o CMakeFiles/OGDF-tulip-4.8.dir/src/coin/Clp/ClpLinearObjective.cpp.o CMakeFiles/OGDF-tulip-4.8.dir/src/coin/Clp/ClpLsqr.cpp.o CMakeFiles/OGDF-tulip-4.8.dir/src/coin/Clp/ClpMatrixBase.cpp.o CMakeFiles/OGDF-tulip-4.8.dir/src/coin/Clp/ClpMessage.cpp.o CMakeFiles/OGDF-tulip-4.8.dir/src/coin/Clp/ClpModel.cpp.o CMakeFiles/OGDF-tulip-4.8.dir/src/coin/Clp/ClpNetworkBasis.cpp.o CMakeFiles/OGDF-tulip-4.8.dir/src/coin/Clp/ClpNetworkMatrix.cpp.o CMakeFiles/OGDF-tulip-4.8.dir/src/coin/Clp/ClpNode.cpp.o CMakeFiles/OGDF-tulip-4.8.dir/src/coin/Clp/ClpNonLinearCost.cpp.o CMakeFiles/OGDF-tulip-4.8.dir/src/coin/Clp/ClpObjective.cpp.o CMakeFiles/OGDF-tulip-4.8.dir/src/coin/Clp/ClpPackedMatrix.cpp.o CMakeFiles/OGDF-tulip-4.8.dir/src/coin/Clp/ClpPdco.cpp.o CMakeFiles/OGDF-tulip-4.8.dir/src/coin/Clp/ClpPdcoBase.cpp.o CMakeFiles/OGDF-tulip-4.8.dir/src/coin/Clp/ClpPlusMinusOneMatrix.cpp.o CMakeFiles/OGDF-tulip-4.8.dir/src/coin/Clp/ClpPredictorCorrector.cpp.o CMakeFiles/OGDF-tulip-4.8.dir/src/coin/Clp/ClpPresolve.cpp.o CMakeFiles/OGDF-tulip-4.8.dir/src/coin/Clp/ClpPrimalColumnDantzig.cpp.o CMakeFiles/OGDF-tulip-4.8.dir/src/coin/Clp/ClpPrimalColumnPivot.cpp.o CMakeFiles/OGDF-tulip-4.8.dir/src/coin/Clp/ClpPrimalColumnSteepest.cpp.o CMakeFiles/OGDF-tulip-4.8.dir/src/coin/Clp/ClpQuadraticObjective.cpp.o CMakeFiles/OGDF-tulip-4.8.dir/src/coin/Clp/ClpSimplex.cpp.o CMakeFiles/OGDF-tulip-4.8.dir/src/coin/Clp/ClpSimplexDual.cpp.o CMakeFiles/OGDF-tulip-4.8.dir/src/coin/Clp/ClpSimplexNonlinear.cpp.o CMakeFiles/OGDF-tulip-4.8.dir/src/coin/Clp/ClpSimplexOther.cpp.o CMakeFiles/OGDF-tulip-4.8.dir/src/coin/Clp/ClpSimplexPrimal.cpp.o CMakeFiles/OGDF-tulip-4.8.dir/src/coin/Clp/ClpSolve.cpp.o CMakeFiles/OGDF-tulip-4.8.dir/src/coin/Clp/Clp_C_Interface.cpp.o CMakeFiles/OGDF-tulip-4.8.dir/src/coin/Clp/IdiSolve.cpp.o CMakeFiles/OGDF-tulip-4.8.dir/src/coin/Clp/Idiot.cpp.o CMakeFiles/OGDF-tulip-4.8.dir/src/coin/Clp/MyEventHandler.cpp.o CMakeFiles/OGDF-tulip-4.8.dir/src/coin/Clp/MyMessageHandler.cpp.o CMakeFiles/OGDF-tulip-4.8.dir/src/coin/Clp/unitTest.cpp.o CMakeFiles/OGDF-tulip-4.8.dir/src/coin/CoinUtils/CoinAlloc.cpp.o CMakeFiles/OGDF-tulip-4.8.dir/src/coin/CoinUtils/CoinBuild.cpp.o CMakeFiles/OGDF-tulip-4.8.dir/src/coin/CoinUtils/CoinDenseFactorization.cpp.o CMakeFiles/OGDF-tulip-4.8.dir/src/coin/CoinUtils/CoinDenseVector.cpp.o CMakeFiles/OGDF-tulip-4.8.dir/src/coin/CoinUtils/CoinError.cpp.o CMakeFiles/OGDF-tulip-4.8.dir/src/coin/CoinUtils/CoinFactorization1.cpp.o CMakeFiles/OGDF-tulip-4.8.dir/src/coin/CoinUtils/CoinFactorization2.cpp.o CMakeFiles/OGDF-tulip-4.8.dir/src/coin/CoinUtils/CoinFactorization3.cpp.o CMakeFiles/OGDF-tulip-4.8.dir/src/coin/CoinUtils/CoinFactorization4.cpp.o CMakeFiles/OGDF-tulip-4.8.dir/src/coin/CoinUtils/CoinFileIO.cpp.o CMakeFiles/OGDF-tulip-4.8.dir/src/coin/CoinUtils/CoinFinite.cpp.o CMakeFiles/OGDF-tulip-4.8.dir/src/coin/CoinUtils/CoinIndexedVector.cpp.o CMakeFiles/OGDF-tulip-4.8.dir/src/coin/CoinUtils/CoinLpIO.cpp.o CMakeFiles/OGDF-tulip-4.8.dir/src/coin/CoinUtils/CoinMessage.cpp.o CMakeFiles/OGDF-tulip-4.8.dir/src/coin/CoinUtils/CoinMessageHandler.cpp.o CMakeFiles/OGDF-tulip-4.8.dir/src/coin/CoinUtils/CoinModel.cpp.o CMakeFiles/OGDF-tulip-4.8.dir/src/coin/CoinUtils/CoinModelUseful.cpp.o CMakeFiles/OGDF-tulip-4.8.dir/src/coin/CoinUtils/CoinModelUseful2.cpp.o CMakeFiles/OGDF-tulip-4.8.dir/src/coin/CoinUtils/CoinMpsIO.cpp.o CMakeFiles/OGDF-tulip-4.8.dir/src/coin/CoinUtils/CoinOslFactorization.cpp.o CMakeFiles/OGDF-tulip-4.8.dir/src/coin/CoinUtils/CoinOslFactorization2.cpp.o CMakeFiles/OGDF-tulip-4.8.dir/src/coin/CoinUtils/CoinOslFactorization3.cpp.o CMakeFiles/OGDF-tulip-4.8.dir/src/coin/CoinUtils/CoinPackedMatrix.cpp.o CMakeFiles/OGDF-tulip-4.8.dir/src/coin/CoinUtils/CoinPackedVector.cpp.o CMakeFiles/OGDF-tulip-4.8.dir/src/coin/CoinUtils/CoinPackedVectorBase.cpp.o CMakeFiles/OGDF-tulip-4.8.dir/src/coin/CoinUtils/CoinParam.cpp.o CMakeFiles/OGDF-tulip-4.8.dir/src/coin/CoinUtils/CoinParamUtils.cpp.o CMakeFiles/OGDF-tulip-4.8.dir/src/coin/CoinUtils/CoinPostsolveMatrix.cpp.o CMakeFiles/OGDF-tulip-4.8.dir/src/coin/CoinUtils/CoinPrePostsolveMatrix.cpp.o CMakeFiles/OGDF-tulip-4.8.dir/src/coin/CoinUtils/CoinPresolveDoubleton.cpp.o CMakeFiles/OGDF-tulip-4.8.dir/src/coin/CoinUtils/CoinPresolveDual.cpp.o CMakeFiles/OGDF-tulip-4.8.dir/src/coin/CoinUtils/CoinPresolveDupcol.cpp.o CMakeFiles/OGDF-tulip-4.8.dir/src/coin/CoinUtils/CoinPresolveEmpty.cpp.o CMakeFiles/OGDF-tulip-4.8.dir/src/coin/CoinUtils/CoinPresolveFixed.cpp.o CMakeFiles/OGDF-tulip-4.8.dir/src/coin/CoinUtils/CoinPresolveForcing.cpp.o CMakeFiles/OGDF-tulip-4.8.dir/src/coin/CoinUtils/CoinPresolveHelperFunctions.cpp.o CMakeFiles/OGDF-tulip-4.8.dir/src/coin/CoinUtils/CoinPresolveImpliedFree.cpp.o CMakeFiles/OGDF-tulip-4.8.dir/src/coin/CoinUtils/CoinPresolveIsolated.cpp.o CMakeFiles/OGDF-tulip-4.8.dir/src/coin/CoinUtils/CoinPresolveMatrix.cpp.o CMakeFiles/OGDF-tulip-4.8.dir/src/coin/CoinUtils/CoinPresolvePsdebug.cpp.o CMakeFiles/OGDF-tulip-4.8.dir/src/coin/CoinUtils/CoinPresolveSingleton.cpp.o CMakeFiles/OGDF-tulip-4.8.dir/src/coin/CoinUtils/CoinPresolveSubst.cpp.o CMakeFiles/OGDF-tulip-4.8.dir/src/coin/CoinUtils/CoinPresolveTighten.cpp.o CMakeFiles/OGDF-tulip-4.8.dir/src/coin/CoinUtils/CoinPresolveTripleton.cpp.o CMakeFiles/OGDF-tulip-4.8.dir/src/coin/CoinUtils/CoinPresolveUseless.cpp.o CMakeFiles/OGDF-tulip-4.8.dir/src/coin/CoinUtils/CoinPresolveZeros.cpp.o CMakeFiles/OGDF-tulip-4.8.dir/src/coin/CoinUtils/CoinSearchTree.cpp.o CMakeFiles/OGDF-tulip-4.8.dir/src/coin/CoinUtils/CoinShallowPackedVector.cpp.o CMakeFiles/OGDF-tulip-4.8.dir/src/coin/CoinUtils/CoinSimpFactorization.cpp.o CMakeFiles/OGDF-tulip-4.8.dir/src/coin/CoinUtils/CoinSnapshot.cpp.o CMakeFiles/OGDF-tulip-4.8.dir/src/coin/CoinUtils/CoinStructuredModel.cpp.o CMakeFiles/OGDF-tulip-4.8.dir/src/coin/CoinUtils/CoinWarmStartBasis.cpp.o CMakeFiles/OGDF-tulip-4.8.dir/src/coin/CoinUtils/CoinWarmStartDual.cpp.o CMakeFiles/OGDF-tulip-4.8.dir/src/coin/CoinUtils/CoinWarmStartPrimalDual.cpp.o CMakeFiles/OGDF-tulip-4.8.dir/src/coin/CoinUtils/CoinWarmStartVector.cpp.o CMakeFiles/OGDF-tulip-4.8.dir/src/coin/Osi/OsiAuxInfo.cpp.o CMakeFiles/OGDF-tulip-4.8.dir/src/coin/Osi/OsiBranchingObject.cpp.o CMakeFiles/OGDF-tulip-4.8.dir/src/coin/Osi/OsiChooseVariable.cpp.o CMakeFiles/OGDF-tulip-4.8.dir/src/coin/Osi/OsiColCut.cpp.o CMakeFiles/OGDF-tulip-4.8.dir/src/coin/Osi/OsiCut.cpp.o CMakeFiles/OGDF-tulip-4.8.dir/src/coin/Osi/OsiCuts.cpp.o CMakeFiles/OGDF-tulip-4.8.dir/src/coin/Osi/OsiNames.cpp.o CMakeFiles/OGDF-tulip-4.8.dir/src/coin/Osi/OsiPresolve.cpp.o CMakeFiles/OGDF-tulip-4.8.dir/src/coin/Osi/OsiRowCut.cpp.o CMakeFiles/OGDF-tulip-4.8.dir/src/coin/Osi/OsiRowCutDebugger.cpp.o CMakeFiles/OGDF-tulip-4.8.dir/src/coin/Osi/OsiSolverBranch.cpp.o CMakeFiles/OGDF-tulip-4.8.dir/src/coin/Osi/OsiSolverInterface.cpp.o CMakeFiles/OGDF-tulip-4.8.dir/src/coin/OsiClp/OsiClpSolverInterface.cpp.o CMakeFiles/OGDF-tulip-4.8.dir/src/coin/Symphony/OsiSymSolverInterface.cpp.o CMakeFiles/OGDF-tulip-4.8.dir/src/coin/Symphony/SymWarmStart.cpp.o CMakeFiles/OGDF-tulip-4.8.dir/src/coin/Symphony/cg_func.cpp.o CMakeFiles/OGDF-tulip-4.8.dir/src/coin/Symphony/cg_proccomm.cpp.o CMakeFiles/OGDF-tulip-4.8.dir/src/coin/Symphony/cg_wrapper.cpp.o CMakeFiles/OGDF-tulip-4.8.dir/src/coin/Symphony/cp_func.cpp.o CMakeFiles/OGDF-tulip-4.8.dir/src/coin/Symphony/cp_proccomm.cpp.o CMakeFiles/OGDF-tulip-4.8.dir/src/coin/Symphony/cp_wrapper.cpp.o CMakeFiles/OGDF-tulip-4.8.dir/src/coin/Symphony/cut_gen.cpp.o CMakeFiles/OGDF-tulip-4.8.dir/src/coin/Symphony/cut_pool.cpp.o CMakeFiles/OGDF-tulip-4.8.dir/src/coin/Symphony/lp.cpp.o CMakeFiles/OGDF-tulip-4.8.dir/src/coin/Symphony/lp_branch.cpp.o CMakeFiles/OGDF-tulip-4.8.dir/src/coin/Symphony/lp_free.cpp.o CMakeFiles/OGDF-tulip-4.8.dir/src/coin/Symphony/lp_genfunc.cpp.o CMakeFiles/OGDF-tulip-4.8.dir/src/coin/Symphony/lp_heuristics.cpp.o CMakeFiles/OGDF-tulip-4.8.dir/src/coin/Symphony/lp_proccomm.cpp.o CMakeFiles/OGDF-tulip-4.8.dir/src/coin/Symphony/lp_rowfunc.cpp.o CMakeFiles/OGDF-tulip-4.8.dir/src/coin/Symphony/lp_solver.cpp.o CMakeFiles/OGDF-tulip-4.8.dir/src/coin/Symphony/lp_sp.cpp.o CMakeFiles/OGDF-tulip-4.8.dir/src/coin/Symphony/lp_varfunc.cpp.o CMakeFiles/OGDF-tulip-4.8.dir/src/coin/Symphony/lp_wrapper.cpp.o CMakeFiles/OGDF-tulip-4.8.dir/src/coin/Symphony/master.cpp.o CMakeFiles/OGDF-tulip-4.8.dir/src/coin/Symphony/master_func.cpp.o CMakeFiles/OGDF-tulip-4.8.dir/src/coin/Symphony/master_io.cpp.o CMakeFiles/OGDF-tulip-4.8.dir/src/coin/Symphony/master_prep.cpp.o CMakeFiles/OGDF-tulip-4.8.dir/src/coin/Symphony/master_prep_base.cpp.o CMakeFiles/OGDF-tulip-4.8.dir/src/coin/Symphony/master_prep_sr.cpp.o CMakeFiles/OGDF-tulip-4.8.dir/src/coin/Symphony/master_wrapper.cpp.o CMakeFiles/OGDF-tulip-4.8.dir/src/coin/Symphony/pack_array.cpp.o CMakeFiles/OGDF-tulip-4.8.dir/src/coin/Symphony/pack_cut.cpp.o CMakeFiles/OGDF-tulip-4.8.dir/src/coin/Symphony/proccomm.cpp.o CMakeFiles/OGDF-tulip-4.8.dir/src/coin/Symphony/sym_qsort.cpp.o CMakeFiles/OGDF-tulip-4.8.dir/src/coin/Symphony/timemeas.cpp.o CMakeFiles/OGDF-tulip-4.8.dir/src/coin/Symphony/tm_func.cpp.o CMakeFiles/OGDF-tulip-4.8.dir/src/coin/Symphony/tm_proccomm.cpp.o CMakeFiles/OGDF-tulip-4.8.dir/src/ogdf/abacus/aba_constraint.cpp.o CMakeFiles/OGDF-tulip-4.8.dir/src/ogdf/abacus/abacusroot.cpp.o CMakeFiles/OGDF-tulip-4.8.dir/src/ogdf/abacus/branchrule.cpp.o CMakeFiles/OGDF-tulip-4.8.dir/src/ogdf/abacus/column.cpp.o CMakeFiles/OGDF-tulip-4.8.dir/src/ogdf/abacus/conbranchrule.cpp.o CMakeFiles/OGDF-tulip-4.8.dir/src/ogdf/abacus/conclass.cpp.o CMakeFiles/OGDF-tulip-4.8.dir/src/ogdf/abacus/convar.cpp.o CMakeFiles/OGDF-tulip-4.8.dir/src/ogdf/abacus/csense.cpp.o CMakeFiles/OGDF-tulip-4.8.dir/src/ogdf/abacus/fixcand.cpp.o CMakeFiles/OGDF-tulip-4.8.dir/src/ogdf/abacus/fsvarstat.cpp.o CMakeFiles/OGDF-tulip-4.8.dir/src/ogdf/abacus/global.cpp.o CMakeFiles/OGDF-tulip-4.8.dir/src/ogdf/abacus/history.cpp.o CMakeFiles/OGDF-tulip-4.8.dir/src/ogdf/abacus/infeascon.cpp.o CMakeFiles/OGDF-tulip-4.8.dir/src/ogdf/abacus/lp.cpp.o CMakeFiles/OGDF-tulip-4.8.dir/src/ogdf/abacus/lpif.cpp.o CMakeFiles/OGDF-tulip-4.8.dir/src/ogdf/abacus/lpmasterosi.cpp.o CMakeFiles/OGDF-tulip-4.8.dir/src/ogdf/abacus/lpsub.cpp.o CMakeFiles/OGDF-tulip-4.8.dir/src/ogdf/abacus/lpvarstat.cpp.o CMakeFiles/OGDF-tulip-4.8.dir/src/ogdf/abacus/master.cpp.o CMakeFiles/OGDF-tulip-4.8.dir/src/ogdf/abacus/opensub.cpp.o CMakeFiles/OGDF-tulip-4.8.dir/src/ogdf/abacus/optsense.cpp.o CMakeFiles/OGDF-tulip-4.8.dir/src/ogdf/abacus/osiif.cpp.o CMakeFiles/OGDF-tulip-4.8.dir/src/ogdf/abacus/row.cpp.o CMakeFiles/OGDF-tulip-4.8.dir/src/ogdf/abacus/setbranchrule.cpp.o CMakeFiles/OGDF-tulip-4.8.dir/src/ogdf/abacus/slackstat.cpp.o CMakeFiles/OGDF-tulip-4.8.dir/src/ogdf/abacus/sparvec.cpp.o CMakeFiles/OGDF-tulip-4.8.dir/src/ogdf/abacus/srowcon.cpp.o CMakeFiles/OGDF-tulip-4.8.dir/src/ogdf/abacus/sub.cpp.o CMakeFiles/OGDF-tulip-4.8.dir/src/ogdf/abacus/tailoff.cpp.o CMakeFiles/OGDF-tulip-4.8.dir/src/ogdf/abacus/valbranchrule.cpp.o CMakeFiles/OGDF-tulip-4.8.dir/src/ogdf/abacus/variable.cpp.o CMakeFiles/OGDF-tulip-4.8.dir/src/ogdf/abacus/vartype.cpp.o CMakeFiles/OGDF-tulip-4.8.dir/src/ogdf/augmentation/DfsMakeBiconnected.cpp.o CMakeFiles/OGDF-tulip-4.8.dir/src/ogdf/augmentation/PlanarAugmentation.cpp.o CMakeFiles/OGDF-tulip-4.8.dir/src/ogdf/augmentation/PlanarAugmentationFix.cpp.o CMakeFiles/OGDF-tulip-4.8.dir/src/ogdf/basic/AdjacencyOracle.cpp.o CMakeFiles/OGDF-tulip-4.8.dir/src/ogdf/basic/CombinatorialEmbedding.cpp.o CMakeFiles/OGDF-tulip-4.8.dir/src/ogdf/basic/Constraint.cpp.o CMakeFiles/OGDF-tulip-4.8.dir/src/ogdf/basic/ConstraintManager.cpp.o CMakeFiles/OGDF-tulip-4.8.dir/src/ogdf/basic/DisjointSets.cpp.o CMakeFiles/OGDF-tulip-4.8.dir/src/ogdf/basic/DualGraph.cpp.o CMakeFiles/OGDF-tulip-4.8.dir/src/ogdf/basic/EdgeComparer.cpp.o CMakeFiles/OGDF-tulip-4.8.dir/src/ogdf/basic/EdgeComparerSimple.cpp.o CMakeFiles/OGDF-tulip-4.8.dir/src/ogdf/basic/Graph.cpp.o CMakeFiles/OGDF-tulip-4.8.dir/src/ogdf/basic/GraphAttributes.cpp.o CMakeFiles/OGDF-tulip-4.8.dir/src/ogdf/basic/GraphConstraints.cpp.o CMakeFiles/OGDF-tulip-4.8.dir/src/ogdf/basic/GraphCopy.cpp.o CMakeFiles/OGDF-tulip-4.8.dir/src/ogdf/basic/GridLayout.cpp.o CMakeFiles/OGDF-tulip-4.8.dir/src/ogdf/basic/GridLayoutModule.cpp.o CMakeFiles/OGDF-tulip-4.8.dir/src/ogdf/basic/Hashing.cpp.o CMakeFiles/OGDF-tulip-4.8.dir/src/ogdf/basic/LayoutStandards.cpp.o CMakeFiles/OGDF-tulip-4.8.dir/src/ogdf/basic/Logger.cpp.o CMakeFiles/OGDF-tulip-4.8.dir/src/ogdf/basic/Math.cpp.o CMakeFiles/OGDF-tulip-4.8.dir/src/ogdf/basic/NearestRectangleFinder.cpp.o CMakeFiles/OGDF-tulip-4.8.dir/src/ogdf/basic/PoolMemoryAllocator.cpp.o CMakeFiles/OGDF-tulip-4.8.dir/src/ogdf/basic/PreprocessorLayout.cpp.o CMakeFiles/OGDF-tulip-4.8.dir/src/ogdf/basic/Stopwatch.cpp.o CMakeFiles/OGDF-tulip-4.8.dir/src/ogdf/basic/System.cpp.o CMakeFiles/OGDF-tulip-4.8.dir/src/ogdf/basic/Thread.cpp.o CMakeFiles/OGDF-tulip-4.8.dir/src/ogdf/basic/basic.cpp.o CMakeFiles/OGDF-tulip-4.8.dir/src/ogdf/basic/config.cpp.o CMakeFiles/OGDF-tulip-4.8.dir/src/ogdf/basic/extended_graph_alg.cpp.o CMakeFiles/OGDF-tulip-4.8.dir/src/ogdf/basic/geometry.cpp.o CMakeFiles/OGDF-tulip-4.8.dir/src/ogdf/basic/graph_generators.cpp.o CMakeFiles/OGDF-tulip-4.8.dir/src/ogdf/basic/graphics.cpp.o CMakeFiles/OGDF-tulip-4.8.dir/src/ogdf/basic/modules.cpp.o CMakeFiles/OGDF-tulip-4.8.dir/src/ogdf/basic/random_hierarchy.cpp.o CMakeFiles/OGDF-tulip-4.8.dir/src/ogdf/basic/simple_graph_alg.cpp.o CMakeFiles/OGDF-tulip-4.8.dir/src/ogdf/basic/stNumber.cpp.o CMakeFiles/OGDF-tulip-4.8.dir/src/ogdf/cluster/CPlanarEdgeInserter.cpp.o CMakeFiles/OGDF-tulip-4.8.dir/src/ogdf/cluster/CPlanarSubCLusteredST.cpp.o CMakeFiles/OGDF-tulip-4.8.dir/src/ogdf/cluster/CPlanarSubClusteredGraph.cpp.o CMakeFiles/OGDF-tulip-4.8.dir/src/ogdf/cluster/CconnectClusterPlanar.cpp.o CMakeFiles/OGDF-tulip-4.8.dir/src/ogdf/cluster/CconnectClusterPlanarEmbed.cpp.o CMakeFiles/OGDF-tulip-4.8.dir/src/ogdf/cluster/ClusterAnalysis.cpp.o CMakeFiles/OGDF-tulip-4.8.dir/src/ogdf/cluster/ClusterGraph.cpp.o CMakeFiles/OGDF-tulip-4.8.dir/src/ogdf/cluster/ClusterGraphAttributes.cpp.o CMakeFiles/OGDF-tulip-4.8.dir/src/ogdf/cluster/ClusterPlanarizationLayout.cpp.o CMakeFiles/OGDF-tulip-4.8.dir/src/ogdf/cluster/Cluster_ChunkConnection.cpp.o CMakeFiles/OGDF-tulip-4.8.dir/src/ogdf/cluster/Cluster_CutConstraint.cpp.o CMakeFiles/OGDF-tulip-4.8.dir/src/ogdf/cluster/Cluster_EdgeVar.cpp.o CMakeFiles/OGDF-tulip-4.8.dir/src/ogdf/cluster/Cluster_MaxPlanarEdges.cpp.o CMakeFiles/OGDF-tulip-4.8.dir/src/ogdf/cluster/Clusterer.cpp.o CMakeFiles/OGDF-tulip-4.8.dir/src/ogdf/cluster/KuratowskiConstraint.cpp.o CMakeFiles/OGDF-tulip-4.8.dir/src/ogdf/cluster/MaxCPlanar_Master.cpp.o CMakeFiles/OGDF-tulip-4.8.dir/src/ogdf/cluster/MaxCPlanar_MinimalClusterConnection.cpp.o CMakeFiles/OGDF-tulip-4.8.dir/src/ogdf/cluster/MaxCPlanar_Sub.cpp.o CMakeFiles/OGDF-tulip-4.8.dir/src/ogdf/cluster/MaximumCPlanarSubgraph.cpp.o CMakeFiles/OGDF-tulip-4.8.dir/src/ogdf/decomposition/BCTree.cpp.o CMakeFiles/OGDF-tulip-4.8.dir/src/ogdf/decomposition/DynamicBCTree.cpp.o CMakeFiles/OGDF-tulip-4.8.dir/src/ogdf/decomposition/DynamicSPQRForest.cpp.o CMakeFiles/OGDF-tulip-4.8.dir/src/ogdf/decomposition/DynamicSPQRTree.cpp.o CMakeFiles/OGDF-tulip-4.8.dir/src/ogdf/decomposition/NonPlanarCore.cpp.o CMakeFiles/OGDF-tulip-4.8.dir/src/ogdf/decomposition/PlanarSPQRTree.cpp.o CMakeFiles/OGDF-tulip-4.8.dir/src/ogdf/decomposition/StaticSPQRTree.cpp.o CMakeFiles/OGDF-tulip-4.8.dir/src/ogdf/decomposition/TricComp.cpp.o CMakeFiles/OGDF-tulip-4.8.dir/src/ogdf/energybased/ArrayGraph.cpp.o CMakeFiles/OGDF-tulip-4.8.dir/src/ogdf/energybased/Attraction.cpp.o CMakeFiles/OGDF-tulip-4.8.dir/src/ogdf/energybased/DavidsonHarel.cpp.o CMakeFiles/OGDF-tulip-4.8.dir/src/ogdf/energybased/DavidsonHarelLayout.cpp.o CMakeFiles/OGDF-tulip-4.8.dir/src/ogdf/energybased/EdgeAttributes.cpp.o CMakeFiles/OGDF-tulip-4.8.dir/src/ogdf/energybased/EnergyFunction.cpp.o CMakeFiles/OGDF-tulip-4.8.dir/src/ogdf/energybased/FMEKernel.cpp.o CMakeFiles/OGDF-tulip-4.8.dir/src/ogdf/energybased/FMEMultipoleKernel.cpp.o CMakeFiles/OGDF-tulip-4.8.dir/src/ogdf/energybased/FMEThread.cpp.o CMakeFiles/OGDF-tulip-4.8.dir/src/ogdf/energybased/FMMMLayout.cpp.o CMakeFiles/OGDF-tulip-4.8.dir/src/ogdf/energybased/FastMultipoleEmbedder.cpp.o CMakeFiles/OGDF-tulip-4.8.dir/src/ogdf/energybased/FruchtermanReingold.cpp.o CMakeFiles/OGDF-tulip-4.8.dir/src/ogdf/energybased/GEMLayout.cpp.o CMakeFiles/OGDF-tulip-4.8.dir/src/ogdf/energybased/GalaxyMultilevel.cpp.o CMakeFiles/OGDF-tulip-4.8.dir/src/ogdf/energybased/IntersectionRectangle.cpp.o CMakeFiles/OGDF-tulip-4.8.dir/src/ogdf/energybased/LinearQuadtree.cpp.o CMakeFiles/OGDF-tulip-4.8.dir/src/ogdf/energybased/LinearQuadtreeBuilder.cpp.o CMakeFiles/OGDF-tulip-4.8.dir/src/ogdf/energybased/LinearQuadtreeExpansion.cpp.o CMakeFiles/OGDF-tulip-4.8.dir/src/ogdf/energybased/MAARPacking.cpp.o CMakeFiles/OGDF-tulip-4.8.dir/src/ogdf/energybased/Multilevel.cpp.o CMakeFiles/OGDF-tulip-4.8.dir/src/ogdf/energybased/MultilevelGraph.cpp.o CMakeFiles/OGDF-tulip-4.8.dir/src/ogdf/energybased/MultilevelLayout.cpp.o CMakeFiles/OGDF-tulip-4.8.dir/src/ogdf/energybased/NMM.cpp.o CMakeFiles/OGDF-tulip-4.8.dir/src/ogdf/energybased/NodeAttributes.cpp.o CMakeFiles/OGDF-tulip-4.8.dir/src/ogdf/energybased/NodePairEnergy.cpp.o CMakeFiles/OGDF-tulip-4.8.dir/src/ogdf/energybased/Overlap.cpp.o CMakeFiles/OGDF-tulip-4.8.dir/src/ogdf/energybased/PivotMDS.cpp.o CMakeFiles/OGDF-tulip-4.8.dir/src/ogdf/energybased/Planarity.cpp.o CMakeFiles/OGDF-tulip-4.8.dir/src/ogdf/energybased/PlanarityGrid.cpp.o CMakeFiles/OGDF-tulip-4.8.dir/src/ogdf/energybased/QuadTreeNM.cpp.o CMakeFiles/OGDF-tulip-4.8.dir/src/ogdf/energybased/QuadTreeNodeNM.cpp.o CMakeFiles/OGDF-tulip-4.8.dir/src/ogdf/energybased/Repulsion.cpp.o CMakeFiles/OGDF-tulip-4.8.dir/src/ogdf/energybased/Set.cpp.o CMakeFiles/OGDF-tulip-4.8.dir/src/ogdf/energybased/SpringEmbedderFR.cpp.o CMakeFiles/OGDF-tulip-4.8.dir/src/ogdf/energybased/SpringEmbedderFRExact.cpp.o CMakeFiles/OGDF-tulip-4.8.dir/src/ogdf/energybased/SpringEmbedderKK.cpp.o CMakeFiles/OGDF-tulip-4.8.dir/src/ogdf/energybased/StressMinimization.cpp.o CMakeFiles/OGDF-tulip-4.8.dir/src/ogdf/energybased/TutteLayout.cpp.o CMakeFiles/OGDF-tulip-4.8.dir/src/ogdf/energybased/UniformGrid.cpp.o CMakeFiles/OGDF-tulip-4.8.dir/src/ogdf/energybased/WSPD.cpp.o CMakeFiles/OGDF-tulip-4.8.dir/src/ogdf/energybased/multilevelmixer/BarycenterPlacer.cpp.o CMakeFiles/OGDF-tulip-4.8.dir/src/ogdf/energybased/multilevelmixer/CirclePlacer.cpp.o CMakeFiles/OGDF-tulip-4.8.dir/src/ogdf/energybased/multilevelmixer/EdgeCoverMerger.cpp.o CMakeFiles/OGDF-tulip-4.8.dir/src/ogdf/energybased/multilevelmixer/IndependentSetMerger.cpp.o CMakeFiles/OGDF-tulip-4.8.dir/src/ogdf/energybased/multilevelmixer/LocalBiconnectedMerger.cpp.o CMakeFiles/OGDF-tulip-4.8.dir/src/ogdf/energybased/multilevelmixer/MMMExampleFastLayout.cpp.o CMakeFiles/OGDF-tulip-4.8.dir/src/ogdf/energybased/multilevelmixer/MMMExampleNiceLayout.cpp.o CMakeFiles/OGDF-tulip-4.8.dir/src/ogdf/energybased/multilevelmixer/MMMExampleNoTwistLayout.cpp.o CMakeFiles/OGDF-tulip-4.8.dir/src/ogdf/energybased/multilevelmixer/MatchingMerger.cpp.o CMakeFiles/OGDF-tulip-4.8.dir/src/ogdf/energybased/multilevelmixer/MedianPlacer.cpp.o CMakeFiles/OGDF-tulip-4.8.dir/src/ogdf/energybased/multilevelmixer/MixedForceLayout.cpp.o CMakeFiles/OGDF-tulip-4.8.dir/src/ogdf/energybased/multilevelmixer/ModularMultilevelMixer.cpp.o CMakeFiles/OGDF-tulip-4.8.dir/src/ogdf/energybased/multilevelmixer/RandomMerger.cpp.o CMakeFiles/OGDF-tulip-4.8.dir/src/ogdf/energybased/multilevelmixer/RandomPlacer.cpp.o CMakeFiles/OGDF-tulip-4.8.dir/src/ogdf/energybased/multilevelmixer/ScalingLayout.cpp.o CMakeFiles/OGDF-tulip-4.8.dir/src/ogdf/energybased/multilevelmixer/SolarMerger.cpp.o CMakeFiles/OGDF-tulip-4.8.dir/src/ogdf/energybased/multilevelmixer/SolarPlacer.cpp.o CMakeFiles/OGDF-tulip-4.8.dir/src/ogdf/energybased/multilevelmixer/ZeroPlacer.cpp.o CMakeFiles/OGDF-tulip-4.8.dir/src/ogdf/energybased/numexcept.cpp.o CMakeFiles/OGDF-tulip-4.8.dir/src/ogdf/external/coin.cpp.o CMakeFiles/OGDF-tulip-4.8.dir/src/ogdf/fileformats/DLParser.cpp.o CMakeFiles/OGDF-tulip-4.8.dir/src/ogdf/fileformats/DOT.cpp.o CMakeFiles/OGDF-tulip-4.8.dir/src/ogdf/fileformats/DotLexer.cpp.o CMakeFiles/OGDF-tulip-4.8.dir/src/ogdf/fileformats/DotParser.cpp.o CMakeFiles/OGDF-tulip-4.8.dir/src/ogdf/fileformats/GDF.cpp.o CMakeFiles/OGDF-tulip-4.8.dir/src/ogdf/fileformats/GEXF.cpp.o CMakeFiles/OGDF-tulip-4.8.dir/src/ogdf/fileformats/GdfParser.cpp.o CMakeFiles/OGDF-tulip-4.8.dir/src/ogdf/fileformats/GexfParser.cpp.o CMakeFiles/OGDF-tulip-4.8.dir/src/ogdf/fileformats/GmlParser.cpp.o CMakeFiles/OGDF-tulip-4.8.dir/src/ogdf/fileformats/GraphIO.cpp.o CMakeFiles/OGDF-tulip-4.8.dir/src/ogdf/fileformats/GraphIO_dl.cpp.o CMakeFiles/OGDF-tulip-4.8.dir/src/ogdf/fileformats/GraphIO_dot.cpp.o CMakeFiles/OGDF-tulip-4.8.dir/src/ogdf/fileformats/GraphIO_gdf.cpp.o CMakeFiles/OGDF-tulip-4.8.dir/src/ogdf/fileformats/GraphIO_gexf.cpp.o CMakeFiles/OGDF-tulip-4.8.dir/src/ogdf/fileformats/GraphIO_gml.cpp.o CMakeFiles/OGDF-tulip-4.8.dir/src/ogdf/fileformats/GraphIO_graphml.cpp.o CMakeFiles/OGDF-tulip-4.8.dir/src/ogdf/fileformats/GraphIO_hyper.cpp.o CMakeFiles/OGDF-tulip-4.8.dir/src/ogdf/fileformats/GraphIO_leda.cpp.o CMakeFiles/OGDF-tulip-4.8.dir/src/ogdf/fileformats/GraphIO_ogml.cpp.o CMakeFiles/OGDF-tulip-4.8.dir/src/ogdf/fileformats/GraphIO_svg.cpp.o CMakeFiles/OGDF-tulip-4.8.dir/src/ogdf/fileformats/GraphIO_tlp.cpp.o CMakeFiles/OGDF-tulip-4.8.dir/src/ogdf/fileformats/GraphML.cpp.o CMakeFiles/OGDF-tulip-4.8.dir/src/ogdf/fileformats/GraphMLParser.cpp.o CMakeFiles/OGDF-tulip-4.8.dir/src/ogdf/fileformats/LineBuffer.cpp.o CMakeFiles/OGDF-tulip-4.8.dir/src/ogdf/fileformats/Ogml.cpp.o CMakeFiles/OGDF-tulip-4.8.dir/src/ogdf/fileformats/OgmlParser.cpp.o CMakeFiles/OGDF-tulip-4.8.dir/src/ogdf/fileformats/Tlp.cpp.o CMakeFiles/OGDF-tulip-4.8.dir/src/ogdf/fileformats/TlpLexer.cpp.o CMakeFiles/OGDF-tulip-4.8.dir/src/ogdf/fileformats/TlpParser.cpp.o CMakeFiles/OGDF-tulip-4.8.dir/src/ogdf/fileformats/UmlDiagramGraph.cpp.o CMakeFiles/OGDF-tulip-4.8.dir/src/ogdf/fileformats/UmlModelGraph.cpp.o CMakeFiles/OGDF-tulip-4.8.dir/src/ogdf/fileformats/UmlToGraphConverter.cpp.o CMakeFiles/OGDF-tulip-4.8.dir/src/ogdf/fileformats/Utils.cpp.o CMakeFiles/OGDF-tulip-4.8.dir/src/ogdf/fileformats/XmlParser.cpp.o CMakeFiles/OGDF-tulip-4.8.dir/src/ogdf/fileformats/XmlScanner.cpp.o CMakeFiles/OGDF-tulip-4.8.dir/src/ogdf/graphalg/CliqueFinder.cpp.o CMakeFiles/OGDF-tulip-4.8.dir/src/ogdf/graphalg/ConvexHull.cpp.o CMakeFiles/OGDF-tulip-4.8.dir/src/ogdf/graphalg/MinCostFlowModule.cpp.o CMakeFiles/OGDF-tulip-4.8.dir/src/ogdf/graphalg/MinCostFlowReinelt.cpp.o CMakeFiles/OGDF-tulip-4.8.dir/src/ogdf/graphalg/MinimumCut.cpp.o CMakeFiles/OGDF-tulip-4.8.dir/src/ogdf/graphalg/PageRank.cpp.o CMakeFiles/OGDF-tulip-4.8.dir/src/ogdf/graphalg/ShortestPathAlgorithms.cpp.o CMakeFiles/OGDF-tulip-4.8.dir/src/ogdf/graphalg/ShortestPathsWithBFM.cpp.o CMakeFiles/OGDF-tulip-4.8.dir/src/ogdf/graphalg/mcf_front_reinelt.cpp.o CMakeFiles/OGDF-tulip-4.8.dir/src/ogdf/hypergraph/EdgeStandardRep.cpp.o CMakeFiles/OGDF-tulip-4.8.dir/src/ogdf/hypergraph/Hypergraph.cpp.o CMakeFiles/OGDF-tulip-4.8.dir/src/ogdf/hypergraph/HypergraphLayout.cpp.o CMakeFiles/OGDF-tulip-4.8.dir/src/ogdf/incremental/SimpleIncNodeInserter.cpp.o CMakeFiles/OGDF-tulip-4.8.dir/src/ogdf/labeling/ELabelPosSimple.cpp.o CMakeFiles/OGDF-tulip-4.8.dir/src/ogdf/layered/BlockOrder.cpp.o CMakeFiles/OGDF-tulip-4.8.dir/src/ogdf/layered/CoffmanGrahamRanking.cpp.o CMakeFiles/OGDF-tulip-4.8.dir/src/ogdf/layered/CrossingsMatrix.cpp.o CMakeFiles/OGDF-tulip-4.8.dir/src/ogdf/layered/FastHierarchyLayout.cpp.o CMakeFiles/OGDF-tulip-4.8.dir/src/ogdf/layered/FastSimpleHierarchyLayout.cpp.o CMakeFiles/OGDF-tulip-4.8.dir/src/ogdf/layered/HierarchyLayoutModule.cpp.o CMakeFiles/OGDF-tulip-4.8.dir/src/ogdf/layered/OptimalHierarchyClusterLayout.cpp.o CMakeFiles/OGDF-tulip-4.8.dir/src/ogdf/layered/OptimalHierarchyLayout.cpp.o CMakeFiles/OGDF-tulip-4.8.dir/src/ogdf/layered/OptimalRanking.cpp.o CMakeFiles/OGDF-tulip-4.8.dir/src/ogdf/layered/SplitHeuristic.cpp.o CMakeFiles/OGDF-tulip-4.8.dir/src/ogdf/layered/acyclic_subgraph.cpp.o CMakeFiles/OGDF-tulip-4.8.dir/src/ogdf/layered/heuristics.cpp.o CMakeFiles/OGDF-tulip-4.8.dir/src/ogdf/layered/ranking.cpp.o CMakeFiles/OGDF-tulip-4.8.dir/src/ogdf/layered/sugiyama-cluster.cpp.o CMakeFiles/OGDF-tulip-4.8.dir/src/ogdf/layered/sugiyama.cpp.o CMakeFiles/OGDF-tulip-4.8.dir/src/ogdf/lpsolver/LPSolver_coin.cpp.o CMakeFiles/OGDF-tulip-4.8.dir/src/ogdf/misclayout/BalloonLayout.cpp.o CMakeFiles/OGDF-tulip-4.8.dir/src/ogdf/misclayout/BertaultLayout.cpp.o CMakeFiles/OGDF-tulip-4.8.dir/src/ogdf/misclayout/CircularLayout.cpp.o CMakeFiles/OGDF-tulip-4.8.dir/src/ogdf/misclayout/ProcrustesSubLayout.cpp.o CMakeFiles/OGDF-tulip-4.8.dir/src/ogdf/orthogonal/ClusterOrthoLayout.cpp.o CMakeFiles/OGDF-tulip-4.8.dir/src/ogdf/orthogonal/ClusterOrthoShaper.cpp.o CMakeFiles/OGDF-tulip-4.8.dir/src/ogdf/orthogonal/CompactionConstraintGraph.cpp.o CMakeFiles/OGDF-tulip-4.8.dir/src/ogdf/orthogonal/EdgeRouter.cpp.o CMakeFiles/OGDF-tulip-4.8.dir/src/ogdf/orthogonal/FlowCompaction.cpp.o CMakeFiles/OGDF-tulip-4.8.dir/src/ogdf/orthogonal/LongestPathCompaction.cpp.o CMakeFiles/OGDF-tulip-4.8.dir/src/ogdf/orthogonal/NodeInfo.cpp.o CMakeFiles/OGDF-tulip-4.8.dir/src/ogdf/orthogonal/OrthoLayout.cpp.o CMakeFiles/OGDF-tulip-4.8.dir/src/ogdf/orthogonal/OrthoRep.cpp.o CMakeFiles/OGDF-tulip-4.8.dir/src/ogdf/orthogonal/OrthoShaper.cpp.o CMakeFiles/OGDF-tulip-4.8.dir/src/ogdf/packing/CCLayoutPackModule.cpp.o CMakeFiles/OGDF-tulip-4.8.dir/src/ogdf/packing/ComponentSplitterLayout.cpp.o CMakeFiles/OGDF-tulip-4.8.dir/src/ogdf/packing/TileToRowsCCPacker.cpp.o CMakeFiles/OGDF-tulip-4.8.dir/src/ogdf/planarity/BoothLueker.cpp.o CMakeFiles/OGDF-tulip-4.8.dir/src/ogdf/planarity/BoyerMyrvold.cpp.o CMakeFiles/OGDF-tulip-4.8.dir/src/ogdf/planarity/BoyerMyrvoldInit.cpp.o CMakeFiles/OGDF-tulip-4.8.dir/src/ogdf/planarity/BoyerMyrvoldPlanar.cpp.o CMakeFiles/OGDF-tulip-4.8.dir/src/ogdf/planarity/CliqueReplacer.cpp.o CMakeFiles/OGDF-tulip-4.8.dir/src/ogdf/planarity/ClusterPlanRep.cpp.o CMakeFiles/OGDF-tulip-4.8.dir/src/ogdf/planarity/CrossingStructure.cpp.o CMakeFiles/OGDF-tulip-4.8.dir/src/ogdf/planarity/EmbedPQTree.cpp.o CMakeFiles/OGDF-tulip-4.8.dir/src/ogdf/planarity/EmbedderMaxFace.cpp.o CMakeFiles/OGDF-tulip-4.8.dir/src/ogdf/planarity/EmbedderMaxFaceLayers.cpp.o CMakeFiles/OGDF-tulip-4.8.dir/src/ogdf/planarity/EmbedderMinDepth.cpp.o CMakeFiles/OGDF-tulip-4.8.dir/src/ogdf/planarity/EmbedderMinDepthMaxFace.cpp.o CMakeFiles/OGDF-tulip-4.8.dir/src/ogdf/planarity/EmbedderMinDepthMaxFaceLayers.cpp.o CMakeFiles/OGDF-tulip-4.8.dir/src/ogdf/planarity/EmbedderMinDepthPiTa.cpp.o CMakeFiles/OGDF-tulip-4.8.dir/src/ogdf/planarity/EmbedderOptimalFlexDraw.cpp.o CMakeFiles/OGDF-tulip-4.8.dir/src/ogdf/planarity/ExtractKuratowskis.cpp.o CMakeFiles/OGDF-tulip-4.8.dir/src/ogdf/planarity/FastPlanarSubgraph.cpp.o CMakeFiles/OGDF-tulip-4.8.dir/src/ogdf/planarity/FindKuratowskis.cpp.o CMakeFiles/OGDF-tulip-4.8.dir/src/ogdf/planarity/FixEdgeInserterCore.cpp.o CMakeFiles/OGDF-tulip-4.8.dir/src/ogdf/planarity/FixedEmbeddingInserter.cpp.o CMakeFiles/OGDF-tulip-4.8.dir/src/ogdf/planarity/GraphReduction.cpp.o CMakeFiles/OGDF-tulip-4.8.dir/src/ogdf/planarity/Layout.cpp.o CMakeFiles/OGDF-tulip-4.8.dir/src/ogdf/planarity/MDMFLengthAttribute.cpp.o CMakeFiles/OGDF-tulip-4.8.dir/src/ogdf/planarity/MMCrossingMinimizationModule.cpp.o CMakeFiles/OGDF-tulip-4.8.dir/src/ogdf/planarity/MMFixedEmbeddingInserter.cpp.o CMakeFiles/OGDF-tulip-4.8.dir/src/ogdf/planarity/MMSubgraphPlanarizer.cpp.o CMakeFiles/OGDF-tulip-4.8.dir/src/ogdf/planarity/MMVariableEmbeddingInserter.cpp.o CMakeFiles/OGDF-tulip-4.8.dir/src/ogdf/planarity/MaximalPlanarSubgraphSimple.cpp.o CMakeFiles/OGDF-tulip-4.8.dir/src/ogdf/planarity/MaximumPlanarSubgraph.cpp.o CMakeFiles/OGDF-tulip-4.8.dir/src/ogdf/planarity/MultiEdgeApproxInserter.cpp.o CMakeFiles/OGDF-tulip-4.8.dir/src/ogdf/planarity/PlanRep.cpp.o CMakeFiles/OGDF-tulip-4.8.dir/src/ogdf/planarity/PlanRepExpansion.cpp.o CMakeFiles/OGDF-tulip-4.8.dir/src/ogdf/planarity/PlanRepInc.cpp.o CMakeFiles/OGDF-tulip-4.8.dir/src/ogdf/planarity/PlanRepLight.cpp.o CMakeFiles/OGDF-tulip-4.8.dir/src/ogdf/planarity/PlanarPQTree.cpp.o CMakeFiles/OGDF-tulip-4.8.dir/src/ogdf/planarity/PlanarSubgraphModule.cpp.o CMakeFiles/OGDF-tulip-4.8.dir/src/ogdf/planarity/PlanarSubgraphPQTree.cpp.o CMakeFiles/OGDF-tulip-4.8.dir/src/ogdf/planarity/PlanarizationGridLayout.cpp.o CMakeFiles/OGDF-tulip-4.8.dir/src/ogdf/planarity/PlanarizationLayout.cpp.o CMakeFiles/OGDF-tulip-4.8.dir/src/ogdf/planarity/SimpleEmbedder.cpp.o CMakeFiles/OGDF-tulip-4.8.dir/src/ogdf/planarity/SubgraphPlanarizer.cpp.o CMakeFiles/OGDF-tulip-4.8.dir/src/ogdf/planarity/TopologyModule.cpp.o CMakeFiles/OGDF-tulip-4.8.dir/src/ogdf/planarity/VarEdgeInserterCore.cpp.o CMakeFiles/OGDF-tulip-4.8.dir/src/ogdf/planarity/VarEdgeInserterDynCore.cpp.o CMakeFiles/OGDF-tulip-4.8.dir/src/ogdf/planarity/VariableEmbeddingInserter.cpp.o CMakeFiles/OGDF-tulip-4.8.dir/src/ogdf/planarity/VariableEmbeddingInserterDyn.cpp.o CMakeFiles/OGDF-tulip-4.8.dir/src/ogdf/planarlayout/BiconnectedShellingOrder.cpp.o CMakeFiles/OGDF-tulip-4.8.dir/src/ogdf/planarlayout/FPPLayout.cpp.o CMakeFiles/OGDF-tulip-4.8.dir/src/ogdf/planarlayout/IOPoints.cpp.o CMakeFiles/OGDF-tulip-4.8.dir/src/ogdf/planarlayout/MMCBBase.cpp.o CMakeFiles/OGDF-tulip-4.8.dir/src/ogdf/planarlayout/MixedModelBase.cpp.o CMakeFiles/OGDF-tulip-4.8.dir/src/ogdf/planarlayout/MixedModelCrossingsBeautifierModule.cpp.o CMakeFiles/OGDF-tulip-4.8.dir/src/ogdf/planarlayout/MixedModelLayout.cpp.o CMakeFiles/OGDF-tulip-4.8.dir/src/ogdf/planarlayout/PlanarDrawLayout.cpp.o CMakeFiles/OGDF-tulip-4.8.dir/src/ogdf/planarlayout/PlanarStraightLayout.cpp.o CMakeFiles/OGDF-tulip-4.8.dir/src/ogdf/planarlayout/SchnyderLayout.cpp.o CMakeFiles/OGDF-tulip-4.8.dir/src/ogdf/planarlayout/ShellingOrder.cpp.o CMakeFiles/OGDF-tulip-4.8.dir/src/ogdf/planarlayout/ShellingOrderModule.cpp.o CMakeFiles/OGDF-tulip-4.8.dir/src/ogdf/planarlayout/TriconnectedShellingOrder.cpp.o CMakeFiles/OGDF-tulip-4.8.dir/src/ogdf/simultaneous/SimDraw.cpp.o CMakeFiles/OGDF-tulip-4.8.dir/src/ogdf/simultaneous/SimDrawCaller.cpp.o CMakeFiles/OGDF-tulip-4.8.dir/src/ogdf/simultaneous/SimDrawColorizer.cpp.o CMakeFiles/OGDF-tulip-4.8.dir/src/ogdf/simultaneous/SimDrawCreator.cpp.o CMakeFiles/OGDF-tulip-4.8.dir/src/ogdf/simultaneous/SimDrawCreatorSimple.cpp.o CMakeFiles/OGDF-tulip-4.8.dir/src/ogdf/simultaneous/SimDrawManipulatorModule.cpp.o CMakeFiles/OGDF-tulip-4.8.dir/src/ogdf/tree/LCA.cpp.o CMakeFiles/OGDF-tulip-4.8.dir/src/ogdf/tree/RadialTreeLayout.cpp.o CMakeFiles/OGDF-tulip-4.8.dir/src/ogdf/tree/TreeLayout.cpp.o CMakeFiles/OGDF-tulip-4.8.dir/src/ogdf/uml/FixedEmbeddingInserterUML.cpp.o CMakeFiles/OGDF-tulip-4.8.dir/src/ogdf/uml/OrthoLayoutUML.cpp.o CMakeFiles/OGDF-tulip-4.8.dir/src/ogdf/uml/PlanRepUML.cpp.o CMakeFiles/OGDF-tulip-4.8.dir/src/ogdf/uml/PlanarizationLayoutUML.cpp.o CMakeFiles/OGDF-tulip-4.8.dir/src/ogdf/uml/PlanarizationLayoutUML_inc.cpp.o CMakeFiles/OGDF-tulip-4.8.dir/src/ogdf/uml/SubgraphPlanarizerUML.cpp.o CMakeFiles/OGDF-tulip-4.8.dir/src/ogdf/uml/UMLCrossingMinimizationModule.cpp.o CMakeFiles/OGDF-tulip-4.8.dir/src/ogdf/uml/UMLGraph.cpp.o CMakeFiles/OGDF-tulip-4.8.dir/src/ogdf/uml/VariableEmbeddingInserterDynUML.cpp.o CMakeFiles/OGDF-tulip-4.8.dir/src/ogdf/uml/VariableEmbeddingInserterUML.cpp.o CMakeFiles/OGDF-tulip-4.8.dir/src/ogdf/upward/DominanceLayout.cpp.o CMakeFiles/OGDF-tulip-4.8.dir/src/ogdf/upward/ExpansionGraph.cpp.o CMakeFiles/OGDF-tulip-4.8.dir/src/ogdf/upward/FUPSSimple.cpp.o CMakeFiles/OGDF-tulip-4.8.dir/src/ogdf/upward/FaceSinkGraph.cpp.o CMakeFiles/OGDF-tulip-4.8.dir/src/ogdf/upward/FeasibleUpwardPlanarSubgraph.cpp.o CMakeFiles/OGDF-tulip-4.8.dir/src/ogdf/upward/FixedEmbeddingUpwardEdgeInserter.cpp.o CMakeFiles/OGDF-tulip-4.8.dir/src/ogdf/upward/LayerBasedUPRLayout.cpp.o CMakeFiles/OGDF-tulip-4.8.dir/src/ogdf/upward/SubgraphUpwardPlanarizer.cpp.o CMakeFiles/OGDF-tulip-4.8.dir/src/ogdf/upward/UpwardPlanRep.cpp.o CMakeFiles/OGDF-tulip-4.8.dir/src/ogdf/upward/UpwardPlanarSubgraphModule.cpp.o CMakeFiles/OGDF-tulip-4.8.dir/src/ogdf/upward/UpwardPlanarSubgraphSimple.cpp.o CMakeFiles/OGDF-tulip-4.8.dir/src/ogdf/upward/UpwardPlanarity.cpp.o CMakeFiles/OGDF-tulip-4.8.dir/src/ogdf/upward/UpwardPlanarityEmbeddedDigraph.cpp.o CMakeFiles/OGDF-tulip-4.8.dir/src/ogdf/upward/UpwardPlanaritySingleSource.cpp.o CMakeFiles/OGDF-tulip-4.8.dir/src/ogdf/upward/VisibilityLayout.cpp.o 
cd /<<PKGBUILDDIR>>/obj-arm-linux-gnueabihf/thirdparty/OGDF && /usr/bin/cmake -E cmake_symlink_library libOGDF-tulip-4.8.so.0 libOGDF-tulip-4.8.so.0 libOGDF-tulip-4.8.so
make[4]: Leaving directory '/<<PKGBUILDDIR>>/obj-arm-linux-gnueabihf'
[ 58%] Built target OGDF-tulip-4.8
make[3]: Leaving directory '/<<PKGBUILDDIR>>/obj-arm-linux-gnueabihf'
Makefile:130: recipe for target 'all' failed
make[2]: *** [all] Error 2
make[2]: Leaving directory '/<<PKGBUILDDIR>>/obj-arm-linux-gnueabihf'
dh_auto_build: make -j4 returned exit code 2
debian/rules:13: recipe for target 'override_dh_auto_build-arch' failed
make[1]: *** [override_dh_auto_build-arch] Error 2
make[1]: Leaving directory '/<<PKGBUILDDIR>>'
debian/rules:7: recipe for target 'build-arch' failed
make: *** [build-arch] Error 2

Tail of log for libsis-jhdf5-java on armhf:

[Utils] Attempting to create test-output/junitreports/TEST-ch.systemsx.cisd.hdf5.BitSetConversionTest.xml
[Utils]   Directory test-output/junitreports exists: true
[TestNG] Time taken by org.testng.reporters.JUnitReportReporter@175e721: 14962 ms
[Utils] Attempting to create test-output/testng-failed.xml
[Utils]   Directory test-output exists: true
[Utils] Attempting to create /<<PKGBUILDDIR>>/test-output/All/testng-failed.xml
[Utils]   Directory /<<PKGBUILDDIR>>/test-output/All exists: true
[TestNG] Time taken by [FailedReporter passed=0 failed=0 skipped=0]: 3079 ms
[TestNG] Time taken by org.testng.reporters.XMLReporter@1a4555e: 2756 ms
[TestNG] Time taken by org.testng.reporters.jq.Main@175e2db: 21572 ms
debian/rules:46: recipe for target 'override_dh_auto_test' failed
make[1]: *** [override_dh_auto_test] Error 3
make[1]: Leaving directory '/<<PKGBUILDDIR>>'
debian/rules:16: recipe for target 'build-arch' failed
make: *** [build-arch] Error 2

Tail of log for krita on armhf:

/<<BUILDDIR>>/krita-3.1.1+dfsg/libs/ui/opengl/kis_opengl_image_textures.cpp:591:45: error: 'GL_RGBA16' was not declared in this scope
             m_texturesInfo.internalFormat = GL_RGBA16;
                                             ^~~~~~~~~
libs/ui/CMakeFiles/kritaui.dir/build.make:3789: recipe for target 'libs/ui/CMakeFiles/kritaui.dir/opengl/kis_opengl_image_textures.cpp.o' failed
make[3]: *** [libs/ui/CMakeFiles/kritaui.dir/opengl/kis_opengl_image_textures.cpp.o] Error 1
make[3]: Leaving directory '/<<BUILDDIR>>/krita-3.1.1+dfsg/obj-arm-linux-gnueabihf'
CMakeFiles/Makefile2:18345: recipe for target 'libs/ui/CMakeFiles/kritaui.dir/all' failed
make[2]: *** [libs/ui/CMakeFiles/kritaui.dir/all] Error 2
make[2]: Leaving directory '/<<BUILDDIR>>/krita-3.1.1+dfsg/obj-arm-linux-gnueabihf'
Makefile:141: recipe for target 'all' failed
make[1]: *** [all] Error 2
make[1]: Leaving directory '/<<BUILDDIR>>/krita-3.1.1+dfsg/obj-arm-linux-gnueabihf'
dh_auto_build: make -j4 returned exit code 2
debian/rules:18: recipe for target 'build-arch' failed
make: *** [build-arch] Error 2

Tail of log for sagemath on armhf:

during this run of 'make all'):

The build directory may contain configuration files and other potentially
helpful information. WARNING: if you now run 'make' again, the build
directory will, by default, be deleted. Set the environment variable
SAGE_KEEP_BUILT_SPKGS to 'yes' to prevent this.

Makefile:16: recipe for target 'all' failed
make[2]: *** [all] Error 1
make[2]: Leaving directory '/<<PKGBUILDDIR>>/sage'
debian/rules:86: recipe for target 'dh_auto_build-stamp' failed
make[1]: *** [dh_auto_build-stamp] Error 2
make[1]: Leaving directory '/<<PKGBUILDDIR>>'
debian/rules:41: recipe for target 'build-arch' failed
make: *** [build-arch] Error 2

Tail of log for globus-proxy-utils on armhf:

============================================================================
Makefile:555: recipe for target 'test-suite.log' failed
make[4]: *** [test-suite.log] Error 1
make[4]: Leaving directory '/<<PKGBUILDDIR>>/test'
Makefile:661: recipe for target 'check-TESTS' failed
make[3]: *** [check-TESTS] Error 2
make[3]: Leaving directory '/<<PKGBUILDDIR>>/test'
Makefile:741: recipe for target 'check-am' failed
make[2]: *** [check-am] Error 2
make[2]: Leaving directory '/<<PKGBUILDDIR>>/test'
Makefile:462: recipe for target 'check-recursive' failed
make[1]: *** [check-recursive] Error 1
make[1]: Leaving directory '/<<PKGBUILDDIR>>'
debian/rules:55: recipe for target 'build-stamp' failed
make: *** [build-stamp] Error 2

Tail of log for aeskulap on armhf:

make[3]: *** [poolservers.lo] Error 1
make[3]: *** Waiting for unfinished jobs....
libtool: compile:  g++ -DHAVE_CONFIG_H -I. -I.. -I../configuration -DHAVE_CONFIG_H -I/usr/include -pthread -I/usr/include/gtkmm-2.4 -I/usr/lib/arm-linux-gnueabihf/gtkmm-2.4/include -I/usr/include/atkmm-1.6 -I/usr/include/gtk-unix-print-2.0 -I/usr/include/gtk-2.0 -I/usr/include/gdkmm-2.4 -I/usr/lib/arm-linux-gnueabihf/gdkmm-2.4/include -I/usr/include/giomm-2.4 -I/usr/lib/arm-linux-gnueabihf/giomm-2.4/include -I/usr/include/pangomm-1.4 -I/usr/lib/arm-linux-gnueabihf/pangomm-1.4/include -I/usr/include/glibmm-2.4 -I/usr/lib/arm-linux-gnueabihf/glibmm-2.4/include -I/usr/include/cairomm-1.0 -I/usr/lib/arm-linux-gnueabihf/cairomm-1.0/include -I/usr/include/sigc++-2.0 -I/usr/lib/arm-linux-gnueabihf/sigc++-2.0/include -I/usr/include/gtk-2.0 -I/usr/lib/arm-linux-gnueabihf/gtk-2.0/include -I/usr/include/gio-unix-2.0/ -I/usr/include/cairo -I/usr/include/pango-1.0 -I/usr/include/atk-1.0 -I/usr/include/cairo -I/usr/include/pixman-1 -I/usr/include/libpng16 -I/usr/include/gdk-pixbuf-2.0 -I/usr/include/libpng16 -I/usr/include/pango-1.0 -I/usr/include/harfbuzz -I/usr/include/pango-1.0 -I/usr/include/glib-2.0 -I/usr/lib/arm-linux-gnueabihf/glib-2.0/include -I/usr/include/freetype2 -Wdate-time -D_FORTIFY_SOURCE=2 -g -O2 -fdebug-prefix-map=/<<BUILDDIR>>/aeskulap-0.2.2b1+git20161206=. -fstack-protector-strong -Wformat -Werror=format-security -c dicomdir.cpp -o dicomdir.o >/dev/null 2>&1
libtool: compile:  g++ -DHAVE_CONFIG_H -I. -I.. -I../configuration -DHAVE_CONFIG_H -I/usr/include -pthread -I/usr/include/gtkmm-2.4 -I/usr/lib/arm-linux-gnueabihf/gtkmm-2.4/include -I/usr/include/atkmm-1.6 -I/usr/include/gtk-unix-print-2.0 -I/usr/include/gtk-2.0 -I/usr/include/gdkmm-2.4 -I/usr/lib/arm-linux-gnueabihf/gdkmm-2.4/include -I/usr/include/giomm-2.4 -I/usr/lib/arm-linux-gnueabihf/giomm-2.4/include -I/usr/include/pangomm-1.4 -I/usr/lib/arm-linux-gnueabihf/pangomm-1.4/include -I/usr/include/glibmm-2.4 -I/usr/lib/arm-linux-gnueabihf/glibmm-2.4/include -I/usr/include/cairomm-1.0 -I/usr/lib/arm-linux-gnueabihf/cairomm-1.0/include -I/usr/include/sigc++-2.0 -I/usr/lib/arm-linux-gnueabihf/sigc++-2.0/include -I/usr/include/gtk-2.0 -I/usr/lib/arm-linux-gnueabihf/gtk-2.0/include -I/usr/include/gio-unix-2.0/ -I/usr/include/cairo -I/usr/include/pango-1.0 -I/usr/include/atk-1.0 -I/usr/include/cairo -I/usr/include/pixman-1 -I/usr/include/libpng16 -I/usr/include/gdk-pixbuf-2.0 -I/usr/include/libpng16 -I/usr/include/pango-1.0 -I/usr/include/harfbuzz -I/usr/include/pango-1.0 -I/usr/include/glib-2.0 -I/usr/lib/arm-linux-gnueabihf/glib-2.0/include -I/usr/include/freetype2 -Wdate-time -D_FORTIFY_SOURCE=2 -g -O2 -fdebug-prefix-map=/<<BUILDDIR>>/aeskulap-0.2.2b1+git20161206=. -fstack-protector-strong -Wformat -Werror=format-security -c dicomdirloader.cpp -o dicomdirloader.o >/dev/null 2>&1
libtool: compile:  g++ -DHAVE_CONFIG_H -I. -I.. -I../configuration -DHAVE_CONFIG_H -I/usr/include -pthread -I/usr/include/gtkmm-2.4 -I/usr/lib/arm-linux-gnueabihf/gtkmm-2.4/include -I/usr/include/atkmm-1.6 -I/usr/include/gtk-unix-print-2.0 -I/usr/include/gtk-2.0 -I/usr/include/gdkmm-2.4 -I/usr/lib/arm-linux-gnueabihf/gdkmm-2.4/include -I/usr/include/giomm-2.4 -I/usr/lib/arm-linux-gnueabihf/giomm-2.4/include -I/usr/include/pangomm-1.4 -I/usr/lib/arm-linux-gnueabihf/pangomm-1.4/include -I/usr/include/glibmm-2.4 -I/usr/lib/arm-linux-gnueabihf/glibmm-2.4/include -I/usr/include/cairomm-1.0 -I/usr/lib/arm-linux-gnueabihf/cairomm-1.0/include -I/usr/include/sigc++-2.0 -I/usr/lib/arm-linux-gnueabihf/sigc++-2.0/include -I/usr/include/gtk-2.0 -I/usr/lib/arm-linux-gnueabihf/gtk-2.0/include -I/usr/include/gio-unix-2.0/ -I/usr/include/cairo -I/usr/include/pango-1.0 -I/usr/include/atk-1.0 -I/usr/include/cairo -I/usr/include/pixman-1 -I/usr/include/libpng16 -I/usr/include/gdk-pixbuf-2.0 -I/usr/include/libpng16 -I/usr/include/pango-1.0 -I/usr/include/harfbuzz -I/usr/include/pango-1.0 -I/usr/include/glib-2.0 -I/usr/lib/arm-linux-gnueabihf/glib-2.0/include -I/usr/include/freetype2 -Wdate-time -D_FORTIFY_SOURCE=2 -g -O2 -fdebug-prefix-map=/<<BUILDDIR>>/aeskulap-0.2.2b1+git20161206=. -fstack-protector-strong -Wformat -Werror=format-security -c loader.cpp -o loader.o >/dev/null 2>&1
make[3]: Leaving directory '/<<BUILDDIR>>/aeskulap-0.2.2b1+git20161206/imagepool'
Makefile:490: recipe for target 'all-recursive' failed
make[2]: *** [all-recursive] Error 1
make[2]: Leaving directory '/<<BUILDDIR>>/aeskulap-0.2.2b1+git20161206'
Makefile:422: recipe for target 'all' failed
make[1]: *** [all] Error 2
make[1]: Leaving directory '/<<BUILDDIR>>/aeskulap-0.2.2b1+git20161206'
dh_auto_build: make -j4 returned exit code 2
debian/rules:6: recipe for target 'build-arch' failed
make: *** [build-arch] Error 2

Tail of log for librsb on armhf:

Checking hardcoded RSB_USER_SET_MEM_HIERARCHY_INFO symbol
Checking hardcoded RSB_DETECTED_MEM_HIERARCHY_INFO symbol
Available memory hierarchy info string: ""
./scripts/readme-tests.sh: line 2: 25233 Aborted                 ./rsbench -oa -Ob -f ${srcdir}/A.mtx -qH -R -n1 -t100 --verbose
Makefile:2621: recipe for target 'mtests' failed
make[3]: *** [mtests] Error 255
make[3]: Leaving directory '/<<PKGBUILDDIR>>'
Makefile:2627: recipe for target 'qtests' failed
make[2]: *** [qtests] Error 2
make[2]: Leaving directory '/<<PKGBUILDDIR>>'
debian/rules:23: recipe for target 'override_dh_auto_test' failed
make[1]: *** [override_dh_auto_test] Error 2
make[1]: Leaving directory '/<<PKGBUILDDIR>>'
debian/rules:6: recipe for target 'build-arch' failed
make: *** [build-arch] Error 2

Tail of log for openjfx on armhf:

	at org.gradle.api.internal.tasks.execution.ExecuteActionsTaskExecuter.executeAction(ExecuteActionsTaskExecuter.java:95)
	at org.gradle.api.internal.tasks.execution.ExecuteActionsTaskExecuter.executeActions(ExecuteActionsTaskExecuter.java:76)
	... 58 more


BUILD FAILED

Total time: 1 hrs 52 mins 13.567 secs
Stopped 0 compiler daemon(s).
dh_auto_build: gradle --info --console plain --offline --stacktrace --no-daemon --refresh-dependencies --gradle-user-home .gradle -Duser.home=. -Duser.name=debian -Ddebian.package=openjfx sdk -x javadoc -x src returned exit code 1
debian/rules:32: recipe for target 'override_dh_auto_build-arch' failed
make[1]: *** [override_dh_auto_build-arch] Error 25
make[1]: Leaving directory '/<<PKGBUILDDIR>>'
debian/rules:26: recipe for target 'build-arch' failed
make: *** [build-arch] Error 2

Tail of log for memcached on armhf:

ok 21 - binary_set
ok 22 - binary_setq
ok 23 - binary_add
ok 24 - binary_addq
ok 25 - binary_replace
ok 26 - binary_replaceq
ok 27 - binary_delete
ok 28 - binary_deleteq
testapp: testapp.c:725: safe_recv: Assertion `nr != 0' failed.
Makefile:1588: recipe for target 'test' failed
make[1]: *** [test] Aborted
make[1]: Leaving directory '/<<PKGBUILDDIR>>'
dh_auto_test: make -j4 test VERBOSE=1 returned exit code 2
debian/rules:49: recipe for target 'build-arch' failed
make: *** [build-arch] Error 2

Tail of log for git-annex on armhf:

[548 of 549] Compiling Test             ( Test.hs, dist/build/git-annex/git-annex-tmp/Test.o )
ghc: panic! (the 'impossible' happened)
  (GHC version 8.0.1 for arm-unknown-linux):
	expectJust cpeBody:collect_args
CallStack (from HasCallStack):
  error, called at compiler/utils/Maybes.hs:48:27 in ghc:Maybes

Please report this as a GHC bug:  http://www.haskell.org/ghc/reportabug

Makefile:26: recipe for target 'git-annex' failed
make[1]: *** [git-annex] Error 1
make[1]: Leaving directory '/<<PKGBUILDDIR>>'
dh_auto_build: make -j1 returned exit code 2
debian/rules:15: recipe for target 'build-arch' failed
make: *** [build-arch] Error 2

Tail of log for abiword on armhf:

make[5]: *** Waiting for unfinished jobs....
make[5]: *** wait: No child processes.  Stop.
make[1]: *** wait: No child processes.  Stop.
make[1]: *** Waiting for unfinished jobs....
make[1]: *** wait: No child processes.  Stop.
make[2]: *** wait: No child processes.  Stop.
make[2]: *** Waiting for unfinished jobs....
make[2]: *** wait: No child processes.  Stop.
E: Caught signal ‘Terminated’: terminating immediately
make: *** wait: No child processes.  Stop.
make: *** Waiting for unfinished jobs....
make: *** wait: No child processes.  Stop.
Makefile:1015: recipe for target 'testwrap.sh.log' failed
make[8]: *** [testwrap.sh.log] Terminated
E: Build killed with signal TERM after 1500 minutes of inactivity

Tail of log for blender on armhf:

cd /<<BUILDDIR>>/blender-2.79.b+dfsg0/obj-arm-linux-gnueabihf/source/blender/freestyle && /usr/bin/c++   -DWITH_FREESTYLE -DWITH_INTERNATIONAL -D_FILE_OFFSET_BITS=64 -D_LARGEFILE64_SOURCE -D_LARGEFILE_SOURCE -D__LITTLE_ENDIAN__ -I/<<BUILDDIR>>/blender-2.79.b+dfsg0/source/blender/freestyle -I/<<BUILDDIR>>/blender-2.79.b+dfsg0/source/blender/blenkernel -I/<<BUILDDIR>>/blender-2.79.b+dfsg0/source/blender/blenlib -I/<<BUILDDIR>>/blender-2.79.b+dfsg0/source/blender/blentranslation -I/<<BUILDDIR>>/blender-2.79.b+dfsg0/source/blender/imbuf -I/<<BUILDDIR>>/blender-2.79.b+dfsg0/source/blender/makesdna -I/<<BUILDDIR>>/blender-2.79.b+dfsg0/source/blender/makesrna -I/<<BUILDDIR>>/blender-2.79.b+dfsg0/source/blender/python -I/<<BUILDDIR>>/blender-2.79.b+dfsg0/source/blender/python/intern -I/<<BUILDDIR>>/blender-2.79.b+dfsg0/source/blender/render/extern/include -I/<<BUILDDIR>>/blender-2.79.b+dfsg0/source/blender/render/intern/include -I/<<BUILDDIR>>/blender-2.79.b+dfsg0/extern/glew/include -I/<<BUILDDIR>>/blender-2.79.b+dfsg0/intern/guardedalloc -isystem /usr/include/python3.5m  -Wredundant-decls -Wall -Wno-invalid-offsetof -Wno-sign-compare -Wlogical-op -Winit-self -Wmissing-include-dirs -Wno-div-by-zero -Wtype-limits -Werror=return-type -Werror=implicit-function-declaration -Wno-char-subscripts -Wno-unknown-pragmas -Wpointer-arith -Wunused-parameter -Wwrite-strings -Wundef -Wformat-signedness -Wuninitialized -Wundef -Wmissing-declarations -g -O2 -fdebug-prefix-map=/<<BUILDDIR>>/blender-2.79.b+dfsg0=. -fstack-protector-strong -Wformat -Werror=format-security -Wdate-time -D_FORTIFY_SOURCE=2 -fuse-ld=gold -fopenmp -std=c++11 -pipe -fPIC -funsigned-char -fno-strict-aliasing   -o CMakeFiles/bf_freestyle.dir/intern/winged_edge/WingedEdgeBuilder.cpp.o -c /<<BUILDDIR>>/blender-2.79.b+dfsg0/source/blender/freestyle/intern/winged_edge/WingedEdgeBuilder.cpp
[ 98%] Linking CXX static library ../../../lib/libbf_freestyle.a
cd /<<BUILDDIR>>/blender-2.79.b+dfsg0/obj-arm-linux-gnueabihf/source/blender/freestyle && /usr/bin/cmake -P CMakeFiles/bf_freestyle.dir/cmake_clean_target.cmake
cd /<<BUILDDIR>>/blender-2.79.b+dfsg0/obj-arm-linux-gnueabihf/source/blender/freestyle && /usr/bin/cmake -E cmake_link_script CMakeFiles/bf_freestyle.dir/link.txt --verbose=1
/usr/bin/ar qc ../../../lib/libbf_freestyle.a  CMakeFiles/bf_freestyle.dir/intern/application/AppCanvas.cpp.o CMakeFiles/bf_freestyle.dir/intern/application/AppConfig.cpp.o CMakeFiles/bf_freestyle.dir/intern/application/AppView.cpp.o CMakeFiles/bf_freestyle.dir/intern/application/Controller.cpp.o CMakeFiles/bf_freestyle.dir/intern/blender_interface/BlenderFileLoader.cpp.o CMakeFiles/bf_freestyle.dir/intern/blender_interface/BlenderStrokeRenderer.cpp.o CMakeFiles/bf_freestyle.dir/intern/blender_interface/FRS_freestyle.cpp.o CMakeFiles/bf_freestyle.dir/intern/geometry/Bezier.cpp.o CMakeFiles/bf_freestyle.dir/intern/geometry/FastGrid.cpp.o CMakeFiles/bf_freestyle.dir/intern/geometry/FitCurve.cpp.o CMakeFiles/bf_freestyle.dir/intern/geometry/GeomCleaner.cpp.o CMakeFiles/bf_freestyle.dir/intern/geometry/GeomUtils.cpp.o CMakeFiles/bf_freestyle.dir/intern/geometry/Grid.cpp.o CMakeFiles/bf_freestyle.dir/intern/geometry/GridHelpers.cpp.o CMakeFiles/bf_freestyle.dir/intern/geometry/HashGrid.cpp.o CMakeFiles/bf_freestyle.dir/intern/geometry/Noise.cpp.o CMakeFiles/bf_freestyle.dir/intern/geometry/matrix_util.cpp.o CMakeFiles/bf_freestyle.dir/intern/geometry/normal_cycle.cpp.o CMakeFiles/bf_freestyle.dir/intern/image/GaussianFilter.cpp.o CMakeFiles/bf_freestyle.dir/intern/image/ImagePyramid.cpp.o CMakeFiles/bf_freestyle.dir/intern/python/BPy_BBox.cpp.o CMakeFiles/bf_freestyle.dir/intern/python/BPy_BinaryPredicate0D.cpp.o CMakeFiles/bf_freestyle.dir/intern/python/BPy_BinaryPredicate1D.cpp.o CMakeFiles/bf_freestyle.dir/intern/python/BPy_ContextFunctions.cpp.o CMakeFiles/bf_freestyle.dir/intern/python/BPy_Convert.cpp.o CMakeFiles/bf_freestyle.dir/intern/python/BPy_Freestyle.cpp.o CMakeFiles/bf_freestyle.dir/intern/python/BPy_FrsMaterial.cpp.o CMakeFiles/bf_freestyle.dir/intern/python/BPy_FrsNoise.cpp.o CMakeFiles/bf_freestyle.dir/intern/python/BPy_Id.cpp.o CMakeFiles/bf_freestyle.dir/intern/python/BPy_IntegrationType.cpp.o CMakeFiles/bf_freestyle.dir/intern/python/BPy_Interface0D.cpp.o CMakeFiles/bf_freestyle.dir/intern/python/BPy_Interface1D.cpp.o CMakeFiles/bf_freestyle.dir/intern/python/BPy_Iterator.cpp.o CMakeFiles/bf_freestyle.dir/intern/python/BPy_MediumType.cpp.o CMakeFiles/bf_freestyle.dir/intern/python/BPy_Nature.cpp.o CMakeFiles/bf_freestyle.dir/intern/python/BPy_Operators.cpp.o CMakeFiles/bf_freestyle.dir/intern/python/BPy_SShape.cpp.o CMakeFiles/bf_freestyle.dir/intern/python/BPy_StrokeAttribute.cpp.o CMakeFiles/bf_freestyle.dir/intern/python/BPy_StrokeShader.cpp.o CMakeFiles/bf_freestyle.dir/intern/python/BPy_UnaryFunction0D.cpp.o CMakeFiles/bf_freestyle.dir/intern/python/BPy_UnaryFunction1D.cpp.o CMakeFiles/bf_freestyle.dir/intern/python/BPy_UnaryPredicate0D.cpp.o CMakeFiles/bf_freestyle.dir/intern/python/BPy_UnaryPredicate1D.cpp.o CMakeFiles/bf_freestyle.dir/intern/python/BPy_ViewMap.cpp.o CMakeFiles/bf_freestyle.dir/intern/python/BPy_ViewShape.cpp.o CMakeFiles/bf_freestyle.dir/intern/python/BinaryPredicate1D/BPy_FalseBP1D.cpp.o CMakeFiles/bf_freestyle.dir/intern/python/BinaryPredicate1D/BPy_Length2DBP1D.cpp.o CMakeFiles/bf_freestyle.dir/intern/python/BinaryPredicate1D/BPy_SameShapeIdBP1D.cpp.o CMakeFiles/bf_freestyle.dir/intern/python/BinaryPredicate1D/BPy_TrueBP1D.cpp.o CMakeFiles/bf_freestyle.dir/intern/python/BinaryPredicate1D/BPy_ViewMapGradientNormBP1D.cpp.o CMakeFiles/bf_freestyle.dir/intern/python/Director.cpp.o CMakeFiles/bf_freestyle.dir/intern/python/Interface0D/BPy_CurvePoint.cpp.o CMakeFiles/bf_freestyle.dir/intern/python/Interface0D/BPy_SVertex.cpp.o CMakeFiles/bf_freestyle.dir/intern/python/Interface0D/BPy_ViewVertex.cpp.o CMakeFiles/bf_freestyle.dir/intern/python/Interface0D/CurvePoint/BPy_StrokeVertex.cpp.o CMakeFiles/bf_freestyle.dir/intern/python/Interface0D/ViewVertex/BPy_NonTVertex.cpp.o CMakeFiles/bf_freestyle.dir/intern/python/Interface0D/ViewVertex/BPy_TVertex.cpp.o CMakeFiles/bf_freestyle.dir/intern/python/Interface1D/BPy_FEdge.cpp.o CMakeFiles/bf_freestyle.dir/intern/python/Interface1D/BPy_FrsCurve.cpp.o CMakeFiles/bf_freestyle.dir/intern/python/Interface1D/BPy_Stroke.cpp.o CMakeFiles/bf_freestyle.dir/intern/python/Interface1D/BPy_ViewEdge.cpp.o CMakeFiles/bf_freestyle.dir/intern/python/Interface1D/Curve/BPy_Chain.cpp.o CMakeFiles/bf_freestyle.dir/intern/python/Interface1D/FEdge/BPy_FEdgeSharp.cpp.o CMakeFiles/bf_freestyle.dir/intern/python/Interface1D/FEdge/BPy_FEdgeSmooth.cpp.o CMakeFiles/bf_freestyle.dir/intern/python/Iterator/BPy_AdjacencyIterator.cpp.o CMakeFiles/bf_freestyle.dir/intern/python/Iterator/BPy_ChainPredicateIterator.cpp.o CMakeFiles/bf_freestyle.dir/intern/python/Iterator/BPy_ChainSilhouetteIterator.cpp.o CMakeFiles/bf_freestyle.dir/intern/python/Iterator/BPy_ChainingIterator.cpp.o CMakeFiles/bf_freestyle.dir/intern/python/Iterator/BPy_CurvePointIterator.cpp.o CMakeFiles/bf_freestyle.dir/intern/python/Iterator/BPy_Interface0DIterator.cpp.o CMakeFiles/bf_freestyle.dir/intern/python/Iterator/BPy_SVertexIterator.cpp.o CMakeFiles/bf_freestyle.dir/intern/python/Iterator/BPy_StrokeVertexIterator.cpp.o CMakeFiles/bf_freestyle.dir/intern/python/Iterator/BPy_ViewEdgeIterator.cpp.o CMakeFiles/bf_freestyle.dir/intern/python/Iterator/BPy_orientedViewEdgeIterator.cpp.o CMakeFiles/bf_freestyle.dir/intern/python/StrokeShader/BPy_BackboneStretcherShader.cpp.o CMakeFiles/bf_freestyle.dir/intern/python/StrokeShader/BPy_BezierCurveShader.cpp.o CMakeFiles/bf_freestyle.dir/intern/python/StrokeShader/BPy_BlenderTextureShader.cpp.o CMakeFiles/bf_freestyle.dir/intern/python/StrokeShader/BPy_CalligraphicShader.cpp.o CMakeFiles/bf_freestyle.dir/intern/python/StrokeShader/BPy_ColorNoiseShader.cpp.o CMakeFiles/bf_freestyle.dir/intern/python/StrokeShader/BPy_ConstantColorShader.cpp.o CMakeFiles/bf_freestyle.dir/intern/python/StrokeShader/BPy_ConstantThicknessShader.cpp.o CMakeFiles/bf_freestyle.dir/intern/python/StrokeShader/BPy_ConstrainedIncreasingThicknessShader.cpp.o CMakeFiles/bf_freestyle.dir/intern/python/StrokeShader/BPy_GuidingLinesShader.cpp.o CMakeFiles/bf_freestyle.dir/intern/python/StrokeShader/BPy_IncreasingColorShader.cpp.o CMakeFiles/bf_freestyle.dir/intern/python/StrokeShader/BPy_IncreasingThicknessShader.cpp.o CMakeFiles/bf_freestyle.dir/intern/python/StrokeShader/BPy_PolygonalizationShader.cpp.o CMakeFiles/bf_freestyle.dir/intern/python/StrokeShader/BPy_SamplingShader.cpp.o CMakeFiles/bf_freestyle.dir/intern/python/StrokeShader/BPy_SmoothingShader.cpp.o CMakeFiles/bf_freestyle.dir/intern/python/StrokeShader/BPy_SpatialNoiseShader.cpp.o CMakeFiles/bf_freestyle.dir/intern/python/StrokeShader/BPy_StrokeTextureStepShader.cpp.o CMakeFiles/bf_freestyle.dir/intern/python/StrokeShader/BPy_ThicknessNoiseShader.cpp.o CMakeFiles/bf_freestyle.dir/intern/python/StrokeShader/BPy_TipRemoverShader.cpp.o CMakeFiles/bf_freestyle.dir/intern/python/UnaryFunction0D/BPy_UnaryFunction0DDouble.cpp.o CMakeFiles/bf_freestyle.dir/intern/python/UnaryFunction0D/BPy_UnaryFunction0DEdgeNature.cpp.o CMakeFiles/bf_freestyle.dir/intern/python/UnaryFunction0D/BPy_UnaryFunction0DFloat.cpp.o CMakeFiles/bf_freestyle.dir/intern/python/UnaryFunction0D/BPy_UnaryFunction0DId.cpp.o CMakeFiles/bf_freestyle.dir/intern/python/UnaryFunction0D/BPy_UnaryFunction0DMaterial.cpp.o CMakeFiles/bf_freestyle.dir/intern/python/UnaryFunction0D/BPy_UnaryFunction0DUnsigned.cpp.o CMakeFiles/bf_freestyle.dir/intern/python/UnaryFunction0D/BPy_UnaryFunction0DVec2f.cpp.o CMakeFiles/bf_freestyle.dir/intern/python/UnaryFunction0D/BPy_UnaryFunction0DVec3f.cpp.o CMakeFiles/bf_freestyle.dir/intern/python/UnaryFunction0D/BPy_UnaryFunction0DVectorViewShape.cpp.o CMakeFiles/bf_freestyle.dir/intern/python/UnaryFunction0D/BPy_UnaryFunction0DViewShape.cpp.o CMakeFiles/bf_freestyle.dir/intern/python/UnaryFunction0D/UnaryFunction0D_Id/BPy_ShapeIdF0D.cpp.o CMakeFiles/bf_freestyle.dir/intern/python/UnaryFunction0D/UnaryFunction0D_Material/BPy_MaterialF0D.cpp.o CMakeFiles/bf_freestyle.dir/intern/python/UnaryFunction0D/UnaryFunction0D_Nature_EdgeNature/BPy_CurveNatureF0D.cpp.o CMakeFiles/bf_freestyle.dir/intern/python/UnaryFunction0D/UnaryFunction0D_Vec2f/BPy_Normal2DF0D.cpp.o CMakeFiles/bf_freestyle.dir/intern/python/UnaryFunction0D/UnaryFunction0D_Vec2f/BPy_VertexOrientation2DF0D.cpp.o CMakeFiles/bf_freestyle.dir/intern/python/UnaryFunction0D/UnaryFunction0D_Vec3f/BPy_VertexOrientation3DF0D.cpp.o CMakeFiles/bf_freestyle.dir/intern/python/UnaryFunction0D/UnaryFunction0D_ViewShape/BPy_GetOccludeeF0D.cpp.o CMakeFiles/bf_freestyle.dir/intern/python/UnaryFunction0D/UnaryFunction0D_ViewShape/BPy_GetShapeF0D.cpp.o CMakeFiles/bf_freestyle.dir/intern/python/UnaryFunction0D/UnaryFunction0D_double/BPy_Curvature2DAngleF0D.cpp.o CMakeFiles/bf_freestyle.dir/intern/python/UnaryFunction0D/UnaryFunction0D_double/BPy_DensityF0D.cpp.o CMakeFiles/bf_freestyle.dir/intern/python/UnaryFunction0D/UnaryFunction0D_double/BPy_GetProjectedXF0D.cpp.o CMakeFiles/bf_freestyle.dir/intern/python/UnaryFunction0D/UnaryFunction0D_double/BPy_GetProjectedYF0D.cpp.o CMakeFiles/bf_freestyle.dir/intern/python/UnaryFunction0D/UnaryFunction0D_double/BPy_GetProjectedZF0D.cpp.o CMakeFiles/bf_freestyle.dir/intern/python/UnaryFunction0D/UnaryFunction0D_double/BPy_GetXF0D.cpp.o CMakeFiles/bf_freestyle.dir/intern/python/UnaryFunction0D/UnaryFunction0D_double/BPy_GetYF0D.cpp.o CMakeFiles/bf_freestyle.dir/intern/python/UnaryFunction0D/UnaryFunction0D_double/BPy_GetZF0D.cpp.o CMakeFiles/bf_freestyle.dir/intern/python/UnaryFunction0D/UnaryFunction0D_double/BPy_LocalAverageDepthF0D.cpp.o CMakeFiles/bf_freestyle.dir/intern/python/UnaryFunction0D/UnaryFunction0D_double/BPy_ZDiscontinuityF0D.cpp.o CMakeFiles/bf_freestyle.dir/intern/python/UnaryFunction0D/UnaryFunction0D_float/BPy_GetCurvilinearAbscissaF0D.cpp.o CMakeFiles/bf_freestyle.dir/intern/python/UnaryFunction0D/UnaryFunction0D_float/BPy_GetParameterF0D.cpp.o CMakeFiles/bf_freestyle.dir/intern/python/UnaryFunction0D/UnaryFunction0D_float/BPy_GetViewMapGradientNormF0D.cpp.o CMakeFiles/bf_freestyle.dir/intern/python/UnaryFunction0D/UnaryFunction0D_float/BPy_ReadCompleteViewMapPixelF0D.cpp.o CMakeFiles/bf_freestyle.dir/intern/python/UnaryFunction0D/UnaryFunction0D_float/BPy_ReadMapPixelF0D.cpp.o CMakeFiles/bf_freestyle.dir/intern/python/UnaryFunction0D/UnaryFunction0D_float/BPy_ReadSteerableViewMapPixelF0D.cpp.o CMakeFiles/bf_freestyle.dir/intern/python/UnaryFunction0D/UnaryFunction0D_unsigned_int/BPy_QuantitativeInvisibilityF0D.cpp.o CMakeFiles/bf_freestyle.dir/intern/python/UnaryFunction0D/UnaryFunction0D_vector_ViewShape/BPy_GetOccludersF0D.cpp.o CMakeFiles/bf_freestyle.dir/intern/python/UnaryFunction1D/BPy_UnaryFunction1DDouble.cpp.o CMakeFiles/bf_freestyle.dir/intern/python/UnaryFunction1D/BPy_UnaryFunction1DEdgeNature.cpp.o CMakeFiles/bf_freestyle.dir/intern/python/UnaryFunction1D/BPy_UnaryFunction1DFloat.cpp.o CMakeFiles/bf_freestyle.dir/intern/python/UnaryFunction1D/BPy_UnaryFunction1DUnsigned.cpp.o CMakeFiles/bf_freestyle.dir/intern/python/UnaryFunction1D/BPy_UnaryFunction1DVec2f.cpp.o CMakeFiles/bf_freestyle.dir/intern/python/UnaryFunction1D/BPy_UnaryFunction1DVec3f.cpp.o CMakeFiles/bf_freestyle.dir/intern/python/UnaryFunction1D/BPy_UnaryFunction1DVectorViewShape.cpp.o CMakeFiles/bf_freestyle.dir/intern/python/UnaryFunction1D/BPy_UnaryFunction1DVoid.cpp.o CMakeFiles/bf_freestyle.dir/intern/python/UnaryFunction1D/UnaryFunction1D_Nature_EdgeNature/BPy_CurveNatureF1D.cpp.o CMakeFiles/bf_freestyle.dir/intern/python/UnaryFunction1D/UnaryFunction1D_Vec2f/BPy_Normal2DF1D.cpp.o CMakeFiles/bf_freestyle.dir/intern/python/UnaryFunction1D/UnaryFunction1D_Vec2f/BPy_Orientation2DF1D.cpp.o CMakeFiles/bf_freestyle.dir/intern/python/UnaryFunction1D/UnaryFunction1D_Vec3f/BPy_Orientation3DF1D.cpp.o CMakeFiles/bf_freestyle.dir/intern/python/UnaryFunction1D/UnaryFunction1D_double/BPy_Curvature2DAngleF1D.cpp.o CMakeFiles/bf_freestyle.dir/intern/python/UnaryFunction1D/UnaryFunction1D_double/BPy_DensityF1D.cpp.o CMakeFiles/bf_freestyle.dir/intern/python/UnaryFunction1D/UnaryFunction1D_double/BPy_GetCompleteViewMapDensityF1D.cpp.o CMakeFiles/bf_freestyle.dir/intern/python/UnaryFunction1D/UnaryFunction1D_double/BPy_GetDirectionalViewMapDensityF1D.cpp.o CMakeFiles/bf_freestyle.dir/intern/python/UnaryFunction1D/UnaryFunction1D_double/BPy_GetProjectedXF1D.cpp.o CMakeFiles/bf_freestyle.dir/intern/python/UnaryFunction1D/UnaryFunction1D_double/BPy_GetProjectedYF1D.cpp.o CMakeFiles/bf_freestyle.dir/intern/python/UnaryFunction1D/UnaryFunction1D_double/BPy_GetProjectedZF1D.cpp.o CMakeFiles/bf_freestyle.dir/intern/python/UnaryFunction1D/UnaryFunction1D_double/BPy_GetSteerableViewMapDensityF1D.cpp.o CMakeFiles/bf_freestyle.dir/intern/python/UnaryFunction1D/UnaryFunction1D_double/BPy_GetViewMapGradientNormF1D.cpp.o CMakeFiles/bf_freestyle.dir/intern/python/UnaryFunction1D/UnaryFunction1D_double/BPy_GetXF1D.cpp.o CMakeFiles/bf_freestyle.dir/intern/python/UnaryFunction1D/UnaryFunction1D_double/BPy_GetYF1D.cpp.o CMakeFiles/bf_freestyle.dir/intern/python/UnaryFunction1D/UnaryFunction1D_double/BPy_GetZF1D.cpp.o CMakeFiles/bf_freestyle.dir/intern/python/UnaryFunction1D/UnaryFunction1D_double/BPy_LocalAverageDepthF1D.cpp.o CMakeFiles/bf_freestyle.dir/intern/python/UnaryFunction1D/UnaryFunction1D_double/BPy_ZDiscontinuityF1D.cpp.o CMakeFiles/bf_freestyle.dir/intern/python/UnaryFunction1D/UnaryFunction1D_unsigned_int/BPy_QuantitativeInvisibilityF1D.cpp.o CMakeFiles/bf_freestyle.dir/intern/python/UnaryFunction1D/UnaryFunction1D_vector_ViewShape/BPy_GetOccludeeF1D.cpp.o CMakeFiles/bf_freestyle.dir/intern/python/UnaryFunction1D/UnaryFunction1D_vector_ViewShape/BPy_GetOccludersF1D.cpp.o CMakeFiles/bf_freestyle.dir/intern/python/UnaryFunction1D/UnaryFunction1D_vector_ViewShape/BPy_GetShapeF1D.cpp.o CMakeFiles/bf_freestyle.dir/intern/python/UnaryFunction1D/UnaryFunction1D_void/BPy_ChainingTimeStampF1D.cpp.o CMakeFiles/bf_freestyle.dir/intern/python/UnaryFunction1D/UnaryFunction1D_void/BPy_IncrementChainingTimeStampF1D.cpp.o CMakeFiles/bf_freestyle.dir/intern/python/UnaryFunction1D/UnaryFunction1D_void/BPy_TimeStampF1D.cpp.o CMakeFiles/bf_freestyle.dir/intern/python/UnaryPredicate0D/BPy_FalseUP0D.cpp.o CMakeFiles/bf_freestyle.dir/intern/python/UnaryPredicate0D/BPy_TrueUP0D.cpp.o CMakeFiles/bf_freestyle.dir/intern/python/UnaryPredicate1D/BPy_ContourUP1D.cpp.o CMakeFiles/bf_freestyle.dir/intern/python/UnaryPredicate1D/BPy_DensityLowerThanUP1D.cpp.o CMakeFiles/bf_freestyle.dir/intern/python/UnaryPredicate1D/BPy_EqualToChainingTimeStampUP1D.cpp.o CMakeFiles/bf_freestyle.dir/intern/python/UnaryPredicate1D/BPy_EqualToTimeStampUP1D.cpp.o CMakeFiles/bf_freestyle.dir/intern/python/UnaryPredicate1D/BPy_ExternalContourUP1D.cpp.o CMakeFiles/bf_freestyle.dir/intern/python/UnaryPredicate1D/BPy_FalseUP1D.cpp.o CMakeFiles/bf_freestyle.dir/intern/python/UnaryPredicate1D/BPy_QuantitativeInvisibilityUP1D.cpp.o CMakeFiles/bf_freestyle.dir/intern/python/UnaryPredicate1D/BPy_ShapeUP1D.cpp.o CMakeFiles/bf_freestyle.dir/intern/python/UnaryPredicate1D/BPy_TrueUP1D.cpp.o CMakeFiles/bf_freestyle.dir/intern/python/UnaryPredicate1D/BPy_WithinImageBoundaryUP1D.cpp.o CMakeFiles/bf_freestyle.dir/intern/scene_graph/IndexedFaceSet.cpp.o CMakeFiles/bf_freestyle.dir/intern/scene_graph/LineRep.cpp.o CMakeFiles/bf_freestyle.dir/intern/scene_graph/NodeCamera.cpp.o CMakeFiles/bf_freestyle.dir/intern/scene_graph/NodeDrawingStyle.cpp.o CMakeFiles/bf_freestyle.dir/intern/scene_graph/NodeGroup.cpp.o CMakeFiles/bf_freestyle.dir/intern/scene_graph/NodeLight.cpp.o CMakeFiles/bf_freestyle.dir/intern/scene_graph/NodeSceneRenderLayer.cpp.o CMakeFiles/bf_freestyle.dir/intern/scene_graph/NodeShape.cpp.o CMakeFiles/bf_freestyle.dir/intern/scene_graph/NodeTransform.cpp.o CMakeFiles/bf_freestyle.dir/intern/scene_graph/OrientedLineRep.cpp.o CMakeFiles/bf_freestyle.dir/intern/scene_graph/Rep.cpp.o CMakeFiles/bf_freestyle.dir/intern/scene_graph/SceneHash.cpp.o CMakeFiles/bf_freestyle.dir/intern/scene_graph/ScenePrettyPrinter.cpp.o CMakeFiles/bf_freestyle.dir/intern/scene_graph/SceneVisitor.cpp.o CMakeFiles/bf_freestyle.dir/intern/scene_graph/TriangleRep.cpp.o CMakeFiles/bf_freestyle.dir/intern/scene_graph/VertexRep.cpp.o CMakeFiles/bf_freestyle.dir/intern/stroke/AdvancedFunctions0D.cpp.o CMakeFiles/bf_freestyle.dir/intern/stroke/AdvancedFunctions1D.cpp.o CMakeFiles/bf_freestyle.dir/intern/stroke/AdvancedStrokeShaders.cpp.o CMakeFiles/bf_freestyle.dir/intern/stroke/BasicStrokeShaders.cpp.o CMakeFiles/bf_freestyle.dir/intern/stroke/Canvas.cpp.o CMakeFiles/bf_freestyle.dir/intern/stroke/Chain.cpp.o CMakeFiles/bf_freestyle.dir/intern/stroke/ChainingIterators.cpp.o CMakeFiles/bf_freestyle.dir/intern/stroke/ContextFunctions.cpp.o CMakeFiles/bf_freestyle.dir/intern/stroke/Curve.cpp.o CMakeFiles/bf_freestyle.dir/intern/stroke/Operators.cpp.o CMakeFiles/bf_freestyle.dir/intern/stroke/PSStrokeRenderer.cpp.o CMakeFiles/bf_freestyle.dir/intern/stroke/Predicates0D.cpp.o CMakeFiles/bf_freestyle.dir/intern/stroke/Predicates1D.cpp.o CMakeFiles/bf_freestyle.dir/intern/stroke/Stroke.cpp.o CMakeFiles/bf_freestyle.dir/intern/stroke/StrokeIO.cpp.o CMakeFiles/bf_freestyle.dir/intern/stroke/StrokeLayer.cpp.o CMakeFiles/bf_freestyle.dir/intern/stroke/StrokeRenderer.cpp.o CMakeFiles/bf_freestyle.dir/intern/stroke/StrokeRep.cpp.o CMakeFiles/bf_freestyle.dir/intern/stroke/StrokeShader.cpp.o CMakeFiles/bf_freestyle.dir/intern/stroke/StrokeTesselator.cpp.o CMakeFiles/bf_freestyle.dir/intern/stroke/TextStrokeRenderer.cpp.o CMakeFiles/bf_freestyle.dir/intern/system/BaseObject.cpp.o CMakeFiles/bf_freestyle.dir/intern/system/Exception.cpp.o CMakeFiles/bf_freestyle.dir/intern/system/Iterator.cpp.o CMakeFiles/bf_freestyle.dir/intern/system/PseudoNoise.cpp.o CMakeFiles/bf_freestyle.dir/intern/system/PythonInterpreter.cpp.o CMakeFiles/bf_freestyle.dir/intern/system/RandGen.cpp.o CMakeFiles/bf_freestyle.dir/intern/system/StringUtils.cpp.o CMakeFiles/bf_freestyle.dir/intern/system/TimeStamp.cpp.o CMakeFiles/bf_freestyle.dir/intern/view_map/ArbitraryGridDensityProvider.cpp.o CMakeFiles/bf_freestyle.dir/intern/view_map/AverageAreaGridDensityProvider.cpp.o CMakeFiles/bf_freestyle.dir/intern/view_map/BoxGrid.cpp.o CMakeFiles/bf_freestyle.dir/intern/view_map/CulledOccluderSource.cpp.o CMakeFiles/bf_freestyle.dir/intern/view_map/FEdgeXDetector.cpp.o CMakeFiles/bf_freestyle.dir/intern/view_map/Functions0D.cpp.o CMakeFiles/bf_freestyle.dir/intern/view_map/Functions1D.cpp.o CMakeFiles/bf_freestyle.dir/intern/view_map/HeuristicGridDensityProviderFactory.cpp.o CMakeFiles/bf_freestyle.dir/intern/view_map/Interface0D.cpp.o CMakeFiles/bf_freestyle.dir/intern/view_map/Interface1D.cpp.o CMakeFiles/bf_freestyle.dir/intern/view_map/OccluderSource.cpp.o CMakeFiles/bf_freestyle.dir/intern/view_map/Pow23GridDensityProvider.cpp.o CMakeFiles/bf_freestyle.dir/intern/view_map/Silhouette.cpp.o CMakeFiles/bf_freestyle.dir/intern/view_map/SilhouetteGeomEngine.cpp.o CMakeFiles/bf_freestyle.dir/intern/view_map/SphericalGrid.cpp.o CMakeFiles/bf_freestyle.dir/intern/view_map/SteerableViewMap.cpp.o CMakeFiles/bf_freestyle.dir/intern/view_map/ViewEdgeXBuilder.cpp.o CMakeFiles/bf_freestyle.dir/intern/view_map/ViewMap.cpp.o CMakeFiles/bf_freestyle.dir/intern/view_map/ViewMapBuilder.cpp.o CMakeFiles/bf_freestyle.dir/intern/view_map/ViewMapIO.cpp.o CMakeFiles/bf_freestyle.dir/intern/view_map/ViewMapTesselator.cpp.o CMakeFiles/bf_freestyle.dir/intern/winged_edge/Curvature.cpp.o CMakeFiles/bf_freestyle.dir/intern/winged_edge/WEdge.cpp.o CMakeFiles/bf_freestyle.dir/intern/winged_edge/WFillGrid.cpp.o CMakeFiles/bf_freestyle.dir/intern/winged_edge/WSFillGrid.cpp.o CMakeFiles/bf_freestyle.dir/intern/winged_edge/WXEdge.cpp.o CMakeFiles/bf_freestyle.dir/intern/winged_edge/WXEdgeBuilder.cpp.o CMakeFiles/bf_freestyle.dir/intern/winged_edge/WingedEdgeBuilder.cpp.o
/usr/bin/ranlib ../../../lib/libbf_freestyle.a
make[3]: Leaving directory '/<<BUILDDIR>>/blender-2.79.b+dfsg0/obj-arm-linux-gnueabihf'
[ 98%] Built target bf_freestyle
make[2]: Leaving directory '/<<BUILDDIR>>/blender-2.79.b+dfsg0/obj-arm-linux-gnueabihf'
Makefile:163: recipe for target 'all' failed
make[1]: *** [all] Error 2
make[1]: Leaving directory '/<<BUILDDIR>>/blender-2.79.b+dfsg0/obj-arm-linux-gnueabihf'
dh_auto_build: make -j4 returned exit code 2
debian/rules:77: recipe for target 'build-arch' failed
make: *** [build-arch] Error 2

Tail of log for trafficserver on armhf:

libtool: compile:  c++ -DHAVE_CONFIG_H -I. -I../../lib -I../../proxy/api -I../../proxy/api -I../../lib/atscppapi/src/include -I../../lib/atscppapi/src/include -I../../lib -Wdate-time -D_FORTIFY_SOURCE=2 -Dlinux -D_LARGEFILE64_SOURCE=1 -D_FILE_OFFSET_BITS=64 -D_GNU_SOURCE -D_REENTRANT -D__STDC_LIMIT_MACROS=1 -D__STDC_FORMAT_MACROS=1 -DOPENSSL_NO_SSL_INTERN -I/usr/include/luajit-2.0 -I/usr/include/tcl8.6 -g -O2 -fdebug-prefix-map=/<<PKGBUILDDIR>>=. -fstack-protector-strong -Wformat -Werror=format-security -O3 -std=c++11 -pipe -Wall -Wextra -Wno-ignored-qualifiers -Wno-unused-parameter -feliminate-unused-debug-symbols -fno-strict-aliasing -Wno-invalid-offsetof -c ruleset.cc  -fPIC -DPIC -o .libs/ruleset.o
/bin/bash ../../libtool  --tag=CXX   --mode=compile c++ -DHAVE_CONFIG_H -I. -I../../lib  -I../../proxy/api -I../../proxy/api -I../../lib/atscppapi/src/include -I../../lib/atscppapi/src/include -I../../lib -Wdate-time -D_FORTIFY_SOURCE=2 -Dlinux -D_LARGEFILE64_SOURCE=1 -D_FILE_OFFSET_BITS=64 -D_GNU_SOURCE -D_REENTRANT -D__STDC_LIMIT_MACROS=1 -D__STDC_FORMAT_MACROS=1 -DOPENSSL_NO_SSL_INTERN -I/usr/include/luajit-2.0 -I/usr/include/tcl8.6  -g -O2 -fdebug-prefix-map=/<<PKGBUILDDIR>>=. -fstack-protector-strong -Wformat -Werror=format-security -O3 -std=c++11 -pipe -Wall -Wextra -Wno-ignored-qualifiers -Wno-unused-parameter -feliminate-unused-debug-symbols -fno-strict-aliasing -Wno-invalid-offsetof -c -o statement.lo statement.cc
libtool: compile:  c++ -DHAVE_CONFIG_H -I. -I../../lib -I../../proxy/api -I../../proxy/api -I../../lib/atscppapi/src/include -I../../lib/atscppapi/src/include -I../../lib -Wdate-time -D_FORTIFY_SOURCE=2 -Dlinux -D_LARGEFILE64_SOURCE=1 -D_FILE_OFFSET_BITS=64 -D_GNU_SOURCE -D_REENTRANT -D__STDC_LIMIT_MACROS=1 -D__STDC_FORMAT_MACROS=1 -DOPENSSL_NO_SSL_INTERN -I/usr/include/luajit-2.0 -I/usr/include/tcl8.6 -g -O2 -fdebug-prefix-map=/<<PKGBUILDDIR>>=. -fstack-protector-strong -Wformat -Werror=format-security -O3 -std=c++11 -pipe -Wall -Wextra -Wno-ignored-qualifiers -Wno-unused-parameter -feliminate-unused-debug-symbols -fno-strict-aliasing -Wno-invalid-offsetof -c statement.cc  -fPIC -DPIC -o .libs/statement.o
Makefile:1010: recipe for target 'conditions.lo' failed
make[3]: *** [conditions.lo] Error 1
make[3]: Leaving directory '/<<PKGBUILDDIR>>/plugins/header_rewrite'
Makefile:631: recipe for target 'all-recursive' failed
make[2]: *** [all-recursive] Error 1
make[2]: Leaving directory '/<<PKGBUILDDIR>>/plugins'
Makefile:682: recipe for target 'all-recursive' failed
make[1]: *** [all-recursive] Error 1
make[1]: Leaving directory '/<<PKGBUILDDIR>>'
dh_auto_build: make -j4 returned exit code 2
debian/rules:29: recipe for target 'build-arch' failed
make: *** [build-arch] Error 2

Tail of log for ycmd on armhf:

Traceback (most recent call last):
  File "./run_tests.py", line 227, in <module>
    Main()
  File "./run_tests.py", line 224, in Main
    NoseTests( parsed_args, nosetests_args )
  File "./run_tests.py", line 212, in NoseTests
    subprocess.check_call( [ 'nosetests' ] + nosetests_args )
  File "/usr/lib/python2.7/subprocess.py", line 186, in check_call
    raise CalledProcessError(retcode, cmd)
subprocess.CalledProcessError: Command '[u'nosetests', u'-v', u'--with-id', '--no-byte-compile', '--exclude=^cs$', '--exclude=javascript', '--exclude=rust', '--exclude=go', '--exclude=AddNearestThirdPartyFoldersToSysPath_', '--exclude=GetCompletions_UnicodeInLineFilter_test', '--exclude=FromHandlerWithSubservers_test', '--exclude=FromWatchdogWithSubservers_test']' returned non-zero exit status 1
debian/rules:42: recipe for target 'override_dh_auto_test' failed
make[1]: *** [override_dh_auto_test] Error 1
make[1]: Leaving directory '/<<BUILDDIR>>/ycmd-0+20161219+git486b809'
debian/rules:35: recipe for target 'build-arch' failed
make: *** [build-arch] Error 2

Tail of log for nifti2dicom on armhf:

  Could not find a package configuration file provided by "ITK" with any of
  the following names:

    ITKConfig.cmake
    itk-config.cmake

  Add the installation prefix of "ITK" to CMAKE_PREFIX_PATH or set "ITK_DIR"
  to a directory containing one of the above files.  If "ITK" provides a
  separate development package or SDK, be sure it has been installed.


-- Configuring incomplete, errors occurred!
See also "/<<PKGBUILDDIR>>/obj-arm-linux-gnueabihf/CMakeFiles/CMakeOutput.log".
/usr/share/cdbs/1/class/cmake.mk:66: recipe for target 'obj-arm-linux-gnueabihf/CMakeCache.txt' failed
make: *** [obj-arm-linux-gnueabihf/CMakeCache.txt] Error 1

Tail of log for ceph on armhf:

dh_install: usr/lib/arm-linux-gnueabihf/ceph/compressor/libceph_example.so.0 exists in debian/tmp but is not installed to anywhere
dh_install: usr/lib/arm-linux-gnueabihf/ceph/compressor/libceph_snappy.so.2 exists in debian/tmp but is not installed to anywhere
dh_install: usr/lib/arm-linux-gnueabihf/ceph/compressor/libceph_example.so exists in debian/tmp but is not installed to anywhere
dh_install: usr/lib/arm-linux-gnueabihf/ceph/compressor/libceph_snappy.so exists in debian/tmp but is not installed to anywhere
dh_install: usr/lib/arm-linux-gnueabihf/ceph/compressor/libceph_example.so.0.0.0 exists in debian/tmp but is not installed to anywhere
dh_install: usr/lib/arm-linux-gnueabihf/ceph/compressor/libceph_snappy.a exists in debian/tmp but is not installed to anywhere
dh_install: usr/lib/arm-linux-gnueabihf/ceph/compressor/libceph_zlib.a exists in debian/tmp but is not installed to anywhere
dh_install: usr/lib/arm-linux-gnueabihf/ceph/compressor/libceph_zlib.so.2 exists in debian/tmp but is not installed to anywhere
dh_install: usr/lib/arm-linux-gnueabihf/ceph/compressor/libceph_zlib.so.2.0.0 exists in debian/tmp but is not installed to anywhere
dh_install: missing files, aborting
debian/rules:97: recipe for target 'override_dh_install' failed
make[1]: *** [override_dh_install] Error 255
make[1]: Leaving directory '/<<PKGBUILDDIR>>'
debian/rules:81: recipe for target 'binary-arch' failed
make: *** [binary-arch] Error 2

Tail of log for chromium-browser on armhf:

This overwrites a previously-defined nonempty list with another nonempty list.
See //third_party/skia/third_party/skcms/skcms.gni:7:15: for previous definition
    defines = [ "SKCMS_PORTABLE=1" ]
              ^--------------------
Did you mean to append/modify instead? If you really want to overwrite, do:
  foo = []
before reassigning.
See //BUILD.gn:69:5: which caused the file to be included.
    "//skia:skia_unittests",
    ^----------------------
debian/rules:96: recipe for target 'override_dh_auto_configure' failed
make[1]: *** [override_dh_auto_configure] Error 1
make[1]: Leaving directory '/<<PKGBUILDDIR>>'
debian/rules:93: recipe for target 'build-arch' failed
make: *** [build-arch] Error 2

Tail of log for golang-1.8 on armhf:

testing: warning: no tests to run
PASS
ok  	_/<<PKGBUILDDIR>>/test/bench/go1	7.849s

##### ../test

##### API check
Go version is "go1.8.1", ignoring -next /<<PKGBUILDDIR>>/api/next.txt

FAILED
debian/rules:57: recipe for target 'override_dh_auto_test-arch' failed
make[1]: *** [override_dh_auto_test-arch] Error 1
make[1]: Leaving directory '/<<PKGBUILDDIR>>'
debian/rules:22: recipe for target 'build-arch' failed
make: *** [build-arch] Error 2

Tail of log for libb2 on armhf:

#define HAVE_STDINT_H 1
#define HAVE_STDLIB_H 1
#define HAVE_STRING_H 1
#define NATIVE_LITTLE_ENDIAN 1
#define HAVE_MEMSET 1
#define HAVE_DLFCN_H 1
#define LT_OBJDIR ".libs/"

configure: exit 1
dh_auto_configure: ./configure --build=arm-linux-gnueabihf --prefix=/usr --includedir=${prefix}/include --mandir=${prefix}/share/man --infodir=${prefix}/share/info --sysconfdir=/etc --localstatedir=/var --disable-silent-rules --libdir=${prefix}/lib/arm-linux-gnueabihf --libexecdir=${prefix}/lib/arm-linux-gnueabihf --disable-maintainer-mode --disable-dependency-tracking --enable-fat returned exit code 1
debian/rules:16: recipe for target 'override_dh_auto_configure' failed
make[1]: *** [override_dh_auto_configure] Error 2
make[1]: Leaving directory '/<<PKGBUILDDIR>>'
debian/rules:13: recipe for target 'build-arch' failed
make: *** [build-arch] Error 2

Tail of log for chromium on armhf:

../../sandbox/linux/seccomp-bpf-helpers/syscall_parameters_restrictions.cc:123:15: note: in expansion of macro 'SANDBOX_BPF_DSL_CASES'
 #define CASES SANDBOX_BPF_DSL_CASES
               ^~~~~~~~~~~~~~~~~~~~~
../../sandbox/linux/seccomp-bpf-helpers/syscall_parameters_restrictions.cc:397:26: note: in expansion of macro 'CASES'
   return Switch(request).CASES((
                          ^~~~~
[3296/20418] CXX obj/sandbox/linux/seccomp_bpf/sigsys_handlers.o
[3297/20418] CXX obj/sandbox/linux/seccomp_bpf/sandbox_bpf.o
[3298/20418] CXX obj/sandbox/linux/seccomp_bpf/policy_compiler.o
ninja: build stopped: subcommand failed.
debian/rules:110: recipe for target 'override_dh_auto_build-arch' failed
make[1]: *** [override_dh_auto_build-arch] Error 1
make[1]: Leaving directory '/<<PKGBUILDDIR>>'
debian/rules:90: recipe for target 'build-arch' failed
make: *** [build-arch] Error 2

Tail of log for bind9 on armhf:

libtool: compile:  gcc -I/<<PKGBUILDDIR>>/build -I../../../.. -I../../../../lib/isc/unix/include -I../../../../lib/isc/unix/../pthreads/include -I../include -I../../../../lib/isc/unix/../include -I../../../../lib/isc/unix/.. -D_REENTRANT -D_LARGEFILE_SOURCE -D_FILE_OFFSET_BITS=64 -D_GNU_SOURCE -g -O2 -fdebug-prefix-map=/<<PKGBUILDDIR>>=. -fstack-protector-strong -Wformat -Werror=format-security -fno-strict-aliasing -fno-delete-null-pointer-checks -DNO_VERSION_DATE -DDIG_SIGCHASE -I/usr/include -I/usr/include/libxml2 -W -Wall -Wmissing-prototypes -Wcast-qual -Wwrite-strings -Wformat -Wpointer-arith -fno-strict-aliasing -fno-delete-null-pointer-checks -c ../../../../lib/isc/unix/stdtime.c  -fPIC -DPIC -o .libs/stdtime.o
libtool: compile:  gcc -I/<<PKGBUILDDIR>>/build -I../../../.. -I../../../../lib/isc/unix/include -I../../../../lib/isc/unix/../pthreads/include -I../include -I../../../../lib/isc/unix/../include -I../../../../lib/isc/unix/.. -D_REENTRANT -D_LARGEFILE_SOURCE -D_FILE_OFFSET_BITS=64 -D_GNU_SOURCE -g -O2 -fdebug-prefix-map=/<<PKGBUILDDIR>>=. -fstack-protector-strong -Wformat -Werror=format-security -fno-strict-aliasing -fno-delete-null-pointer-checks -DNO_VERSION_DATE -DDIG_SIGCHASE -I/usr/include -I/usr/include/libxml2 -W -Wall -Wmissing-prototypes -Wcast-qual -Wwrite-strings -Wformat -Wpointer-arith -fno-strict-aliasing -fno-delete-null-pointer-checks -c ../../../../lib/isc/unix/stdtime.c -o stdtime.o >/dev/null 2>&1
libtool: compile:  gcc -I/<<PKGBUILDDIR>>/build -I../../../.. -I../../../../lib/isc/unix/include -I../../../../lib/isc/unix/../pthreads/include -I../include -I../../../../lib/isc/unix/../include -I../../../../lib/isc/unix/.. -D_REENTRANT -D_LARGEFILE_SOURCE -D_FILE_OFFSET_BITS=64 -D_GNU_SOURCE -g -O2 -fdebug-prefix-map=/<<PKGBUILDDIR>>=. -fstack-protector-strong -Wformat -Werror=format-security -fno-strict-aliasing -fno-delete-null-pointer-checks -DNO_VERSION_DATE -DDIG_SIGCHASE -I/usr/include -I/usr/include/libxml2 -W -Wall -Wmissing-prototypes -Wcast-qual -Wwrite-strings -Wformat -Wpointer-arith -fno-strict-aliasing -fno-delete-null-pointer-checks -c ../../../../lib/isc/unix/socket.c -o socket.o >/dev/null 2>&1
make[4]: Leaving directory '/<<PKGBUILDDIR>>/build/lib/isc/unix'
Makefile:233: recipe for target 'subdirs' failed
make[3]: *** [subdirs] Error 1
make[3]: Leaving directory '/<<PKGBUILDDIR>>/build/lib/isc'
Makefile:95: recipe for target 'subdirs' failed
make[2]: *** [subdirs] Error 1
make[2]: Leaving directory '/<<PKGBUILDDIR>>/build/lib'
Makefile:100: recipe for target 'subdirs' failed
make[1]: *** [subdirs] Error 1
make[1]: Leaving directory '/<<PKGBUILDDIR>>/build'
debian/rules:113: recipe for target 'stamps/build' failed
make: *** [stamps/build] Error 2

Tail of log for neovim on armhf:

CMake Error at /<<PKGBUILDDIR>>/cmake/RunTests.cmake:46 (message):
  Running functional tests failed with error: 1.


FAILED: CMakeFiles/functionaltest 
cd /<<PKGBUILDDIR>>/build && /usr/bin/cmake -DBUSTED_PRG=/usr/bin/busted -DLUA_PRG=/usr/bin/luajit -DNVIM_PRG=/<<PKGBUILDDIR>>/build/bin/nvim -DWORKING_DIR=/<<PKGBUILDDIR>> -DBUSTED_OUTPUT_TYPE=TAP -DTEST_DIR=/<<PKGBUILDDIR>>/test -DBUILD_DIR=/<<PKGBUILDDIR>>/build -DTEST_TYPE=functional -DSYSTEM_NAME=Linux -P /<<PKGBUILDDIR>>/cmake/RunTests.cmake
ninja: build stopped: subcommand failed.
Makefile:95: recipe for target 'functionaltest' failed
make[2]: *** [functionaltest] Error 1
make[2]: Leaving directory '/<<PKGBUILDDIR>>'
debian/rules:55: recipe for target 'override_dh_auto_test-arch' failed
make[1]: *** [override_dh_auto_test-arch] Error 2
make[1]: Leaving directory '/<<PKGBUILDDIR>>'
debian/rules:30: recipe for target 'build-arch' failed
make: *** [build-arch] Error 2

Tail of log for postgresql-9.6 on armhf:

GNUmakefile:130: recipe for target 'check' failed
make[2]: *** [check] Error 2
make[2]: Leaving directory '/<<PKGBUILDDIR>>/build/src/test/regress'
Makefile:28: recipe for target 'check-regress-recurse' failed
make[1]: *** [check-regress-recurse] Error 2
make[1]: Leaving directory '/<<PKGBUILDDIR>>/build/src/test'
GNUmakefile:69: recipe for target 'check-world-src/test-recurse' failed
make: *** [check-world-src/test-recurse] Error 2
make: Leaving directory '/<<PKGBUILDDIR>>/build'
******** build/src/test/regress/regression.diffs ********
debian/rules:213: recipe for target 'override_dh_auto_test-arch' failed
make[1]: *** [override_dh_auto_test-arch] Error 1
make[1]: Leaving directory '/<<PKGBUILDDIR>>'
debian/rules:101: recipe for target 'build-arch' failed
make: *** [build-arch] Error 2

Tail of log for liquidsoap on armhf:

/usr/bin/ld: cannot find -lpng12
collect2: error: ld returned 1 exit status
File "caml_startup", line 1:
Error: Error during linking
../Makefile.rules:170: recipe for target 'plugins/camlimages.cmxs' failed
make[3]: *** [plugins/camlimages.cmxs] Error 2
make[3]: Leaving directory '/<<PKGBUILDDIR>>/src'
../Makefile.rules:67: recipe for target 'all-auto-ocaml-prog' failed
make[2]: *** [all-auto-ocaml-prog] Error 2
make[2]: Leaving directory '/<<PKGBUILDDIR>>/src'
Makefile.rules:27: recipe for target 'all-subdirs' failed
make[1]: *** [all-subdirs] Error 2
make[1]: Leaving directory '/<<PKGBUILDDIR>>'
/usr/share/cdbs/1/class/makefile.mk:77: recipe for target 'debian/stamp-makefile-build' failed
make: *** [debian/stamp-makefile-build] Error 2

Tail of log for openldap on armhf:

Makefile:312: recipe for target 'mdb-mod' failed
make[4]: *** [mdb-mod] Error 1
make[4]: Leaving directory '/<<BUILDDIR>>/openldap-2.4.44+dfsg/debian/build/tests'
Makefile:282: recipe for target 'test' failed
make[3]: *** [test] Error 2
make[3]: Leaving directory '/<<BUILDDIR>>/openldap-2.4.44+dfsg/debian/build/tests'
Makefile:294: recipe for target 'test' failed
make[2]: *** [test] Error 2
make[2]: Leaving directory '/<<BUILDDIR>>/openldap-2.4.44+dfsg/debian/build'
dh_auto_test: make -j4 test VERBOSE=1 returned exit code 2
debian/rules:117: recipe for target 'override_dh_auto_test' failed
make[1]: *** [override_dh_auto_test] Error 2
make[1]: Leaving directory '/<<BUILDDIR>>/openldap-2.4.44+dfsg'
debian/rules:69: recipe for target 'build-arch' failed
make: *** [build-arch] Error 2