Raspbian Package Auto-Building

Buildd status for dumb-init (stretch-staging)

Debian PTSTrackerChangelogBugspackages.d.obuildd.d.o

Package(s): Suite:
Compact mode Co-maintainers

ArchitectureVersionStatusForBuilddStateMiscLogs
Buildd exposure stats armhf  1.2.0-1Build-Attempted906d 12h 32mbm-wb-01out-of-datemisc:sourceold | all (7)

Tail of log for dumb-init on armhf:

    
        # read a line from print_signals, figure out its pid
        line = proc.stdout.readline()
        match = re.match(b'ready \(pid: ([0-9]+)\)\n', line)
>       assert match, line
E       AssertionError: 
E       assert None

tests/child_processes_test.py:95: AssertionError
==================== 2 failed, 170 passed in 23.49 seconds =====================
debian/rules:31: recipe for target 'override_dh_auto_test' failed
make[1]: *** [override_dh_auto_test] Error 1
make[1]: Leaving directory '/<<PKGBUILDDIR>>'
debian/rules:9: recipe for target 'build-arch' failed
make: *** [build-arch] Error 2