Raspbian Package Auto-Building

Buildd status for deng (bullseye-staging)

Debian PTSTrackerChangelogBugspackages.d.obuildd.d.o

Package(s): Suite:
Compact mode Co-maintainers

ArchitectureVersionStatusForBuilddStateMiscLogs
Buildd exposure stats armhf  1.9.0-beta6.9+dfsg1-2.1Build-Attempted72d 23h 13mtest2019uncompiledgames:sourceold | all (10)

Tail of log for deng on armhf:

  175 |                                         pixel[1] = png_info->palette[rows[i][off]].green;
      |                                                            ^~
/<<BUILDDIR>>/deng-1.9.0-beta6.9+dfsg1/doomsday/engine/portable/src/gl_png.c:176:60: error: invalid use of incomplete typedef 'png_info' {aka 'struct png_info_def'}
  176 |                                         pixel[2] = png_info->palette[rows[i][off]].blue;
      |                                                            ^~
/<<BUILDDIR>>/deng-1.9.0-beta6.9+dfsg1/doomsday/engine/portable/src/gl_png.c:183:48: error: invalid use of incomplete typedef 'png_info' {aka 'struct png_info_def'}
  183 |                                     if(png_info->channels == 2) // Alpha data.
      |                                                ^~
make[3]: *** [CMakeFiles/doomsday.dir/build.make:726: CMakeFiles/doomsday.dir/engine/portable/src/gl_png.o] Error 1
make[3]: Leaving directory '/<<BUILDDIR>>/deng-1.9.0-beta6.9+dfsg1/doomsdaybuild'
make[2]: *** [CMakeFiles/Makefile2:209: CMakeFiles/doomsday.dir/all] Error 2
make[2]: Leaving directory '/<<BUILDDIR>>/deng-1.9.0-beta6.9+dfsg1/doomsdaybuild'
make[1]: *** [Makefile:152: all] Error 2
make[1]: Leaving directory '/<<BUILDDIR>>/deng-1.9.0-beta6.9+dfsg1/doomsdaybuild'
make: *** [debian/rules:25: build-stamp] Error 2