Raspbian Package Auto-Building

Buildd status for cups (jessie-staging)

Debian PTSTrackerChangelogBugspackages.d.obuildd.d.o

Package(s): Suite:
Compact mode Co-maintainers

ArchitectureVersionStatusForBuilddStateMiscLogs
Buildd exposure stats armhf  1.7.5-11+deb8u5Build-Attempted29d 6mmb-lxc-01out-of-datenet:sourceold | all (1)

Tail of log for cups on armhf:

httpAssembleURI(): PASS (16 URIs tested)
httpAssembleUUID: PASS (urn:uuid:7c9d59b5-2b0e-3c3f-5bc6-0bb22a46e911)

1 TESTS FAILED!
Makefile:428: recipe for target 'testhttp' failed
make[3]: *** [testhttp] Error 1
make[3]: Leaving directory '/<<PKGBUILDDIR>>/cups'
Makefile:70: recipe for target 'unittests' failed
make[2]: *** [unittests] Error 1
make[2]: Leaving directory '/<<PKGBUILDDIR>>'
debian/rules:157: recipe for target 'override_dh_auto_test' failed
make[1]: *** [override_dh_auto_test] Error 2
make[1]: Leaving directory '/<<PKGBUILDDIR>>'
debian/rules:20: recipe for target 'build-arch' failed
make: *** [build-arch] Error 2