Raspbian Package Auto-Building

Buildd status for criu (bullseye-staging)

Debian PTSTrackerChangelogBugspackages.d.obuildd.d.o

Package(s): Suite:
Compact mode Co-maintainers

ArchitectureVersionStatusForBuilddStateMiscLogs
Buildd exposure stats armhf  1.7-2Build-Attempted11d 3h 31mtestwandboarduncompiledmisc:sourceold | all (5)

Tail of log for criu on armhf:

  192 | #define PTRACE_SETSIGMASK PTRACE_SETSIGMASK
      | 
In file included from include/protobuf.h:8,
                 from arch/arm/crtools.c:9:
include/util.h: In function 'kdev_to_odev':
include/util.h:158:9: error: implicit declaration of function 'makedev' [-Werror=implicit-function-declaration]
  158 |  return makedev(major, minor);
      |         ^~~~~~~
cc1: all warnings being treated as errors
make[2]: *** [scripts/Makefile.build:185: arch/arm/crtools.o] Error 1
make[2]: Leaving directory '/<<PKGBUILDDIR>>'
make[1]: *** [Makefile:208: arch/arm] Error 2
make[1]: Leaving directory '/<<PKGBUILDDIR>>'
dh_auto_build: make -j4 returned exit code 2
make: *** [debian/rules:6: build-arch] Error 255